zookeeper-dev mailing list archives

Site index · List index
Message view « Date » · « Thread »
Top « Date » · « Thread »
From Apache Jenkins Server <jenk...@builds.apache.org>
Subject ZooKeeper_branch35_jdk7 - Build # 753 - Still Failing
Date Sat, 03 Dec 2016 09:02:34 GMT
See https://builds.apache.org/job/ZooKeeper_branch35_jdk7/753/

###################################################################################
########################## LAST 60 LINES OF THE CONSOLE ###########################
[...truncated 437361 lines...]
    [junit] 	at java.net.AbstractPlainSocketImpl.connectToAddress(AbstractPlainSocketImpl.java:200)
    [junit] 	at java.net.AbstractPlainSocketImpl.connect(AbstractPlainSocketImpl.java:182)
    [junit] 	at java.net.SocksSocketImpl.connect(SocksSocketImpl.java:392)
    [junit] 	at java.net.Socket.connect(Socket.java:579)
    [junit] 	at org.apache.zookeeper.server.quorum.QuorumCnxManager.connectOne(QuorumCnxManager.java:441)
    [junit] 	at org.apache.zookeeper.server.quorum.QuorumCnxManager.connectOne(QuorumCnxManager.java:482)
    [junit] 	at org.apache.zookeeper.server.quorum.QuorumCnxManager.toSend(QuorumCnxManager.java:419)
    [junit] 	at org.apache.zookeeper.server.quorum.FastLeaderElection$Messenger$WorkerSender.process(FastLeaderElection.java:486)
    [junit] 	at org.apache.zookeeper.server.quorum.FastLeaderElection$Messenger$WorkerSender.run(FastLeaderElection.java:465)
    [junit] 	at java.lang.Thread.run(Thread.java:745)
    [junit] 2016-12-03 09:00:00,227 [myid:] - INFO  [QuorumPeer[myid=4](plain=/127.0.0.1:24702)(secure=disabled):FastLeaderElection@928]
- Notification time out: 60000
    [junit] 2016-12-03 09:00:00,225 [myid:] - WARN  [WorkerSender[myid=5]:QuorumCnxManager@455]
- Cannot open channel to 1 at election address /127.0.0.1:24694
    [junit] java.net.ConnectException: Connection refused
    [junit] 	at java.net.PlainSocketImpl.socketConnect(Native Method)
    [junit] 	at java.net.AbstractPlainSocketImpl.doConnect(AbstractPlainSocketImpl.java:339)
    [junit] 	at java.net.AbstractPlainSocketImpl.connectToAddress(AbstractPlainSocketImpl.java:200)
    [junit] 	at java.net.AbstractPlainSocketImpl.connect(AbstractPlainSocketImpl.java:182)
    [junit] 	at java.net.SocksSocketImpl.connect(SocksSocketImpl.java:392)
    [junit] 	at java.net.Socket.connect(Socket.java:579)
    [junit] 	at org.apache.zookeeper.server.quorum.QuorumCnxManager.connectOne(QuorumCnxManager.java:441)
    [junit] 	at org.apache.zookeeper.server.quorum.QuorumCnxManager.connectOne(QuorumCnxManager.java:482)
    [junit] 	at org.apache.zookeeper.server.quorum.QuorumCnxManager.toSend(QuorumCnxManager.java:419)
    [junit] 	at org.apache.zookeeper.server.quorum.FastLeaderElection$Messenger$WorkerSender.process(FastLeaderElection.java:486)
    [junit] 	at org.apache.zookeeper.server.quorum.FastLeaderElection$Messenger$WorkerSender.run(FastLeaderElection.java:465)
    [junit] 	at java.lang.Thread.run(Thread.java:745)
    [junit] 2016-12-03 09:00:00,227 [myid:] - WARN  [WorkerSender[myid=5]:QuorumCnxManager@455]
- Cannot open channel to 2 at election address /127.0.0.1:24695
    [junit] java.net.ConnectException: Connection refused
    [junit] 	at java.net.PlainSocketImpl.socketConnect(Native Method)
    [junit] 	at java.net.AbstractPlainSocketImpl.doConnect(AbstractPlainSocketImpl.java:339)
    [junit] 	at java.net.AbstractPlainSocketImpl.connectToAddress(AbstractPlainSocketImpl.java:200)
    [junit] 	at java.net.AbstractPlainSocketImpl.connect(AbstractPlainSocketImpl.java:182)
    [junit] 	at java.net.SocksSocketImpl.connect(SocksSocketImpl.java:392)
    [junit] 	at java.net.Socket.connect(Socket.java:579)
    [junit] 	at org.apache.zookeeper.server.quorum.QuorumCnxManager.connectOne(QuorumCnxManager.java:441)
    [junit] 	at org.apache.zookeeper.server.quorum.QuorumCnxManager.connectOne(QuorumCnxManager.java:482)
    [junit] 	at org.apache.zookeeper.server.quorum.QuorumCnxManager.toSend(QuorumCnxManager.java:419)
    [junit] 	at org.apache.zookeeper.server.quorum.FastLeaderElection$Messenger$WorkerSender.process(FastLeaderElection.java:486)
    [junit] 	at org.apache.zookeeper.server.quorum.FastLeaderElection$Messenger$WorkerSender.run(FastLeaderElection.java:465)
    [junit] 	at java.lang.Thread.run(Thread.java:745)
    [junit] 2016-12-03 09:00:00,233 [myid:] - INFO  [WorkerReceiver[myid=5]:FastLeaderElection@688]
- Notification: 2 (message format version), 5 (n.leader), 0x10000006d (n.zxid), 0x2 (n.round),
LOOKING (n.state), 5 (n.sid), 0x1 (n.peerEPoch), LOOKING (my state)100000000 (n.config version)
    [junit] 2016-12-03 09:00:00,234 [myid:] - INFO  [WorkerReceiver[myid=3]:FastLeaderElection@688]
- Notification: 2 (message format version), 5 (n.leader), 0x10000006d (n.zxid), 0x2 (n.round),
LOOKING (n.state), 5 (n.sid), 0x1 (n.peerEPoch), LEADING (my state)100000000 (n.config version)
    [junit] 2016-12-03 09:00:00,235 [myid:] - INFO  [WorkerReceiver[myid=5]:FastLeaderElection@688]
- Notification: 2 (message format version), 3 (n.leader), 0x0 (n.zxid), 0xffffffffffffffff
(n.round), LEADING (n.state), 3 (n.sid), 0x1 (n.peerEPoch), LOOKING (my state)100000000 (n.config
version)
    [junit] 2016-12-03 09:00:00,235 [myid:] - INFO  [WorkerReceiver[myid=4]:FastLeaderElection@688]
- Notification: 2 (message format version), 5 (n.leader), 0x10000006d (n.zxid), 0x2 (n.round),
LOOKING (n.state), 5 (n.sid), 0x1 (n.peerEPoch), LOOKING (my state)100000000 (n.config version)
    [junit] 2016-12-03 09:00:00,236 [myid:] - INFO  [WorkerReceiver[myid=4]:FastLeaderElection@688]
- Notification: 2 (message format version), 5 (n.leader), 0x10000006d (n.zxid), 0x2 (n.round),
LOOKING (n.state), 4 (n.sid), 0x1 (n.peerEPoch), LOOKING (my state)100000000 (n.config version)
    [junit] 2016-12-03 09:00:00,237 [myid:] - INFO  [WorkerReceiver[myid=3]:FastLeaderElection@688]
- Notification: 2 (message format version), 5 (n.leader), 0x10000006d (n.zxid), 0x2 (n.round),
LOOKING (n.state), 4 (n.sid), 0x1 (n.peerEPoch), LEADING (my state)100000000 (n.config version)
    [junit] 2016-12-03 09:00:00,237 [myid:] - INFO  [WorkerReceiver[myid=4]:FastLeaderElection@688]
- Notification: 2 (message format version), 3 (n.leader), 0x0 (n.zxid), 0xffffffffffffffff
(n.round), LEADING (n.state), 3 (n.sid), 0x1 (n.peerEPoch), LOOKING (my state)100000000 (n.config
version)
    [junit] 2016-12-03 09:00:00,238 [myid:] - INFO  [WorkerReceiver[myid=5]:FastLeaderElection@688]
- Notification: 2 (message format version), 5 (n.leader), 0x10000006d (n.zxid), 0x2 (n.round),
LOOKING (n.state), 4 (n.sid), 0x1 (n.peerEPoch), LOOKING (my state)100000000 (n.config version)
    [junit] Running org.apache.zookeeper.test.QuorumTest in thread 6
    [junit] Tests run: 1, Failures: 0, Errors: 1, Skipped: 0, Time elapsed: 0 sec, Thread:
6, Class: org.apache.zookeeper.test.QuorumTest
    [junit] Test org.apache.zookeeper.test.QuorumTest FAILED (timeout)

BUILD FAILED
/home/jenkins/jenkins-slave/workspace/ZooKeeper_branch35_jdk7/build.xml:1208: Tests failed!

Total time: 22 minutes 49 seconds
Build step 'Invoke Ant' marked build as failure
Recording test results
Email was triggered for: Failure - Any
Sending email for trigger: Failure - Any



###################################################################################
############################## FAILED TESTS (if any) ##############################
10 tests failed.
FAILED:  org.apache.zookeeper.server.ZxidRolloverTest.testMultipleRollover

Error Message:
Timeout occurred. Please note the time in the report does not reflect the time until the timeout.

Stack Trace:
junit.framework.AssertionFailedError: Timeout occurred. Please note the time in the report
does not reflect the time until the timeout.
	at java.lang.Thread.run(Thread.java:745)


FAILED:  org.apache.zookeeper.test.WatcherTest.testWatchAutoResetWithPending

Error Message:
For 56 expected:<1> but was:<0>

Stack Trace:
junit.framework.AssertionFailedError: For 56 expected:<1> but was:<0>
	at org.apache.zookeeper.test.WatcherTest.testWatchAutoResetWithPending(WatcherTest.java:215)
	at org.apache.zookeeper.JUnit4ZKTestRunner$LoggedInvokeMethod.evaluate(JUnit4ZKTestRunner.java:79)


FAILED:  org.apache.zookeeper.test.WatcherTest.testWatchAutoResetWithPending

Error Message:
Unexpected bean exists! expected:<0> but was:<1>

Stack Trace:
junit.framework.AssertionFailedError: Unexpected bean exists! expected:<0> but was:<1>
	at org.apache.zookeeper.test.ClientBase.verifyUnexpectedBeans(ClientBase.java:498)
	at org.apache.zookeeper.test.ClientBase.startServer(ClientBase.java:477)
	at org.apache.zookeeper.test.ClientBase.setUp(ClientBase.java:460)
	at org.apache.zookeeper.test.WatcherTest.setUp(WatcherTest.java:73)


FAILED:  org.apache.zookeeper.test.WatcherTest.testWatcherCorrectness

Error Message:
Unexpected bean exists! expected:<0> but was:<1>

Stack Trace:
junit.framework.AssertionFailedError: Unexpected bean exists! expected:<0> but was:<1>
	at org.apache.zookeeper.test.ClientBase.verifyUnexpectedBeans(ClientBase.java:498)
	at org.apache.zookeeper.test.ClientBase.startServer(ClientBase.java:477)
	at org.apache.zookeeper.test.ClientBase.setUp(ClientBase.java:460)
	at org.apache.zookeeper.test.WatcherTest.setUp(WatcherTest.java:73)


FAILED:  org.apache.zookeeper.test.WatcherTest.testWatcherAutoResetDisabledWithLocal

Error Message:
Unexpected bean exists! expected:<0> but was:<1>

Stack Trace:
junit.framework.AssertionFailedError: Unexpected bean exists! expected:<0> but was:<1>
	at org.apache.zookeeper.test.ClientBase.verifyUnexpectedBeans(ClientBase.java:498)
	at org.apache.zookeeper.test.ClientBase.startServer(ClientBase.java:477)
	at org.apache.zookeeper.test.ClientBase.setUp(ClientBase.java:460)
	at org.apache.zookeeper.test.WatcherTest.setUp(WatcherTest.java:73)


FAILED:  org.apache.zookeeper.test.WatcherTest.testWatcherAutoResetWithGlobal

Error Message:
Unexpected bean exists! expected:<0> but was:<1>

Stack Trace:
junit.framework.AssertionFailedError: Unexpected bean exists! expected:<0> but was:<1>
	at org.apache.zookeeper.test.ClientBase.verifyUnexpectedBeans(ClientBase.java:498)
	at org.apache.zookeeper.test.ClientBase.startServer(ClientBase.java:477)
	at org.apache.zookeeper.test.ClientBase.setUp(ClientBase.java:460)
	at org.apache.zookeeper.test.WatcherTest.setUp(WatcherTest.java:73)


FAILED:  org.apache.zookeeper.test.WatcherTest.testWatcherCount

Error Message:
Unexpected bean exists! expected:<0> but was:<1>

Stack Trace:
junit.framework.AssertionFailedError: Unexpected bean exists! expected:<0> but was:<1>
	at org.apache.zookeeper.test.ClientBase.verifyUnexpectedBeans(ClientBase.java:498)
	at org.apache.zookeeper.test.ClientBase.startServer(ClientBase.java:477)
	at org.apache.zookeeper.test.ClientBase.setUp(ClientBase.java:460)
	at org.apache.zookeeper.test.WatcherTest.setUp(WatcherTest.java:73)


FAILED:  org.apache.zookeeper.test.WatcherTest.testWatcherAutoResetDisabledWithGlobal

Error Message:
Unexpected bean exists! expected:<0> but was:<1>

Stack Trace:
junit.framework.AssertionFailedError: Unexpected bean exists! expected:<0> but was:<1>
	at org.apache.zookeeper.test.ClientBase.verifyUnexpectedBeans(ClientBase.java:498)
	at org.apache.zookeeper.test.ClientBase.startServer(ClientBase.java:477)
	at org.apache.zookeeper.test.ClientBase.setUp(ClientBase.java:460)
	at org.apache.zookeeper.test.WatcherTest.setUp(WatcherTest.java:73)


FAILED:  org.apache.zookeeper.test.WatcherTest.testWatcherAutoResetWithLocal

Error Message:
Unexpected bean exists! expected:<0> but was:<1>

Stack Trace:
junit.framework.AssertionFailedError: Unexpected bean exists! expected:<0> but was:<1>
	at org.apache.zookeeper.test.ClientBase.verifyUnexpectedBeans(ClientBase.java:498)
	at org.apache.zookeeper.test.ClientBase.startServer(ClientBase.java:477)
	at org.apache.zookeeper.test.ClientBase.setUp(ClientBase.java:460)
	at org.apache.zookeeper.test.WatcherTest.setUp(WatcherTest.java:73)


FAILED:  org.apache.zookeeper.test.QuorumTest.testLeaderShutdown

Error Message:
Timeout occurred. Please note the time in the report does not reflect the time until the timeout.

Stack Trace:
junit.framework.AssertionFailedError: Timeout occurred. Please note the time in the report
does not reflect the time until the timeout.
	at java.lang.Thread.run(Thread.java:745)



Mime
  • Unnamed multipart/mixed (inline, None, 0 bytes)
View raw message