zookeeper-dev mailing list archives

Site index · List index
Message view « Date » · « Thread »
Top « Date » · « Thread »
From Apache Jenkins Server <jenk...@builds.apache.org>
Subject ZooKeeper-trunk-solaris - Build # 1433 - Still Failing
Date Wed, 21 Dec 2016 23:21:43 GMT
See https://builds.apache.org/job/ZooKeeper-trunk-solaris/1433/

###################################################################################
########################## LAST 60 LINES OF THE CONSOLE ###########################
[...truncated 922 lines...]
    [junit] 2016-12-21 23:22:44,904 [myid:] - INFO  [NIOServerCxnFactory.AcceptThread:0.0.0.0/0.0.0.0:11228:NIOServerCnxnFactory$AcceptThread@296]
- Accepted socket connection from /127.0.0.1:57412
    [junit] 2016-12-21 23:22:44,905 [myid:] - INFO  [NIOWorkerThread-2:ZooKeeperServer@1000]
- Client attempting to establish new session at /127.0.0.1:57412
    [junit] 2016-12-21 23:22:44,909 [myid:] - INFO  [SyncThread:0:FileTxnLog@204] - Creating
new log file: log.1
    [junit] 2016-12-21 23:22:44,925 [myid:] - INFO  [SyncThread:0:ZooKeeperServer@714] - Established
session 0x125a0ab81ca0000 with negotiated timeout 30000 for client /127.0.0.1:57412
    [junit] 2016-12-21 23:22:44,926 [myid:127.0.0.1:11228] - INFO  [main-SendThread(127.0.0.1:11228):ClientCnxn$SendThread@1381]
- Session establishment complete on server null, sessionid = 0x125a0ab81ca0000, negotiated
timeout = 30000
    [junit] 2016-12-21 23:22:44,927 [myid:] - INFO  [main:JMXEnv@117] - expect:0x125a0ab81ca0000
    [junit] 2016-12-21 23:22:44,927 [myid:] - INFO  [main:JMXEnv@120] - found:0x125a0ab81ca0000
org.apache.ZooKeeperService:name0=StandaloneServer_port11228,name1=Connections,name2=127.0.0.1,name3=0x125a0ab81ca0000
    [junit] 2016-12-21 23:22:44,928 [myid:] - INFO  [Time-limited test:JUnit4ZKTestRunner$LoggedInvokeMethod@77]
- RUNNING TEST METHOD testRemoveNodeChildrenChangedWatches
    [junit] 2016-12-21 23:22:44,970 [myid:] - INFO  [Time-limited test:RemoveWatchesCmdTest@181]
- Adding child changed watcher
    [junit] 2016-12-21 23:22:44,972 [myid:] - INFO  [Time-limited test:RemoveWatchesCmdTest@185]
- Remove watchers using shell command : removewatches /testnode1 -c
    [junit] 2016-12-21 23:22:44,973 [myid:] - INFO  [Time-limited test:JUnit4ZKTestRunner$LoggedInvokeMethod@82]
- Memory used 6396
    [junit] 2016-12-21 23:22:44,974 [myid:] - INFO  [Time-limited test:JUnit4ZKTestRunner$LoggedInvokeMethod@87]
- Number of threads 36
    [junit] 2016-12-21 23:22:44,974 [myid:] - INFO  [Time-limited test:JUnit4ZKTestRunner$LoggedInvokeMethod@102]
- FINISHED TEST METHOD testRemoveNodeChildrenChangedWatches
    [junit] 2016-12-21 23:22:44,974 [myid:] - INFO  [ProcessThread(sid:0 cport:11228)::PrepRequestProcessor@618]
- Processed session termination for sessionid: 0x125a0ab81ca0000
    [junit] 2016-12-21 23:22:45,001 [myid:] - INFO  [NIOWorkerThread-11:MBeanRegistry@128]
- Unregister MBean [org.apache.ZooKeeperService:name0=StandaloneServer_port11228,name1=Connections,name2=127.0.0.1,name3=0x125a0ab81ca0000]
    [junit] 2016-12-21 23:22:45,001 [myid:] - INFO  [main-EventThread:ClientCnxn$EventThread@513]
- EventThread shut down for session: 0x125a0ab81ca0000
    [junit] 2016-12-21 23:22:45,001 [myid:] - INFO  [main:ZooKeeper@1313] - Session: 0x125a0ab81ca0000
closed
    [junit] 2016-12-21 23:22:45,002 [myid:] - INFO  [main:ClientBase@543] - tearDown starting
    [junit] 2016-12-21 23:22:45,002 [myid:] - INFO  [main:ClientBase@513] - STOPPING server
    [junit] 2016-12-21 23:22:45,006 [myid:] - INFO  [NIOWorkerThread-11:NIOServerCnxn@611]
- Closed socket connection for client /127.0.0.1:57412 which had sessionid 0x125a0ab81ca0000
    [junit] 2016-12-21 23:22:45,006 [myid:] - INFO  [ConnnectionExpirer:NIOServerCnxnFactory$ConnectionExpirerThread@583]
- ConnnectionExpirerThread interrupted
    [junit] 2016-12-21 23:22:45,011 [myid:] - INFO  [NIOServerCxnFactory.SelectorThread-0:NIOServerCnxnFactory$SelectorThread@420]
- selector thread exitted run method
    [junit] 2016-12-21 23:22:45,011 [myid:] - INFO  [NIOServerCxnFactory.SelectorThread-1:NIOServerCnxnFactory$SelectorThread@420]
- selector thread exitted run method
    [junit] 2016-12-21 23:22:45,011 [myid:] - INFO  [NIOServerCxnFactory.AcceptThread:0.0.0.0/0.0.0.0:11228:NIOServerCnxnFactory$AcceptThread@219]
- accept thread exitted run method
    [junit] 2016-12-21 23:22:45,012 [myid:] - INFO  [main:ZooKeeperServer@534] - shutting
down
    [junit] 2016-12-21 23:22:45,012 [myid:] - ERROR [main:ZooKeeperServer@506] - ZKShutdownHandler
is not registered, so ZooKeeper server won't take any action on ERROR or SHUTDOWN server state
changes
    [junit] 2016-12-21 23:22:45,012 [myid:] - INFO  [main:SessionTrackerImpl@232] - Shutting
down
    [junit] 2016-12-21 23:22:45,012 [myid:] - INFO  [main:PrepRequestProcessor@1009] - Shutting
down
    [junit] 2016-12-21 23:22:45,012 [myid:] - INFO  [main:SyncRequestProcessor@191] - Shutting
down
    [junit] 2016-12-21 23:22:45,012 [myid:] - INFO  [ProcessThread(sid:0 cport:11228)::PrepRequestProcessor@157]
- PrepRequestProcessor exited loop!
    [junit] 2016-12-21 23:22:45,012 [myid:] - INFO  [SyncThread:0:SyncRequestProcessor@169]
- SyncRequestProcessor exited!
    [junit] 2016-12-21 23:22:45,013 [myid:] - INFO  [main:FinalRequestProcessor@481] - shutdown
of request processor complete
    [junit] 2016-12-21 23:22:45,013 [myid:] - INFO  [main:MBeanRegistry@128] - Unregister
MBean [org.apache.ZooKeeperService:name0=StandaloneServer_port11228,name1=InMemoryDataTree]
    [junit] 2016-12-21 23:22:45,013 [myid:] - INFO  [main:MBeanRegistry@128] - Unregister
MBean [org.apache.ZooKeeperService:name0=StandaloneServer_port11228]
    [junit] 2016-12-21 23:22:45,014 [myid:] - INFO  [main:FourLetterWordMain@85] - connecting
to 127.0.0.1 11228
    [junit] 2016-12-21 23:22:45,014 [myid:] - INFO  [main:JMXEnv@146] - ensureOnly:[]
    [junit] 2016-12-21 23:22:45,018 [myid:] - INFO  [main:ClientBase@568] - fdcount after
test is: 62 at start it was 58
    [junit] 2016-12-21 23:22:45,018 [myid:] - INFO  [main:ClientBase@570] - sleeping for 20
secs
    [junit] 2016-12-21 23:22:45,018 [myid:] - INFO  [main:ZKTestCase$1@65] - SUCCEEDED testRemoveNodeChildrenChangedWatches
    [junit] 2016-12-21 23:22:45,019 [myid:] - INFO  [main:ZKTestCase$1@60] - FINISHED testRemoveNodeChildrenChangedWatches
    [junit] 2016-12-21 23:22:45,821 [myid:] - INFO  [SessionTracker:SessionTrackerImpl@158]
- SessionTrackerImpl exited loop!
    [junit] 2016-12-21 23:22:45,821 [myid:] - INFO  [SessionTracker:SessionTrackerImpl@158]
- SessionTrackerImpl exited loop!
    [junit] 2016-12-21 23:22:45,821 [myid:] - INFO  [SessionTracker:SessionTrackerImpl@158]
- SessionTrackerImpl exited loop!
    [junit] 2016-12-21 23:22:45,821 [myid:] - INFO  [SessionTracker:SessionTrackerImpl@158]
- SessionTrackerImpl exited loop!
    [junit] 2016-12-21 23:22:45,821 [myid:] - INFO  [SessionTracker:SessionTrackerImpl@158]
- SessionTrackerImpl exited loop!
    [junit] Tests run: 7, Failures: 0, Errors: 0, Time elapsed: 33.965 sec
    [junit] Running org.apache.zookeeper.RemoveWatchesTest
    [junit] Tests run: 1, Failures: 0, Errors: 1, Time elapsed: 0 sec

BUILD FAILED
/zonestorage/hudson_solaris/home/hudson/hudson-slave/workspace/ZooKeeper-trunk-solaris/build.xml:1221:
Process fork failed.

Total time: 4 minutes 32 seconds
Build step 'Invoke Ant' marked build as failure
[locks-and-latches] Releasing all the locks
[locks-and-latches] All the locks released
Recording test results
Email was triggered for: Failure - Any
Sending email for trigger: Failure - Any



###################################################################################
############################## FAILED TESTS (if any) ##############################
1 tests failed.
FAILED:  org.apache.zookeeper.RemoveWatchesTest.unknown

Error Message:
Forked Java VM exited abnormally. Please note the time in the report does not reflect the
time until the VM exit.

Stack Trace:
junit.framework.AssertionFailedError: Forked Java VM exited abnormally. Please note the time
in the report does not reflect the time until the VM exit.



Mime
  • Unnamed multipart/mixed (inline, None, 0 bytes)
View raw message