zookeeper-dev mailing list archives

Site index · List index
Message view « Date » · « Thread »
Top « Date » · « Thread »
From Apache Jenkins Server <jenk...@builds.apache.org>
Subject ZooKeeper-trunk - Build # 3202 - Still Failing
Date Tue, 20 Dec 2016 14:33:10 GMT
See https://builds.apache.org/job/ZooKeeper-trunk/3202/

###################################################################################
########################## LAST 60 LINES OF THE CONSOLE ###########################
[...truncated 495936 lines...]
    [junit] 	at org.apache.zookeeper.ClientCnxnSocketNIO.doTransport(ClientCnxnSocketNIO.java:357)
    [junit] 	at org.apache.zookeeper.ClientCnxn$SendThread.run(ClientCnxn.java:1214)
    [junit] 2016-12-20 14:32:00,191 [myid:127.0.0.1:19425] - INFO  [main-SendThread(127.0.0.1:19425):ClientCnxn$SendThread@1113]
- Opening socket connection to server 127.0.0.1/127.0.0.1:19425. Will not attempt to authenticate
using SASL (unknown error)
    [junit] 2016-12-20 14:32:00,192 [myid:127.0.0.1:19425] - WARN  [main-SendThread(127.0.0.1:19425):ClientCnxn$SendThread@1235]
- Session 0x201ad136b0c0000 for server 127.0.0.1/127.0.0.1:19425, unexpected error, closing
socket connection and attempting reconnect
    [junit] java.net.ConnectException: Connection refused
    [junit] 	at sun.nio.ch.SocketChannelImpl.checkConnect(Native Method)
    [junit] 	at sun.nio.ch.SocketChannelImpl.finishConnect(SocketChannelImpl.java:744)
    [junit] 	at org.apache.zookeeper.ClientCnxnSocketNIO.doTransport(ClientCnxnSocketNIO.java:357)
    [junit] 	at org.apache.zookeeper.ClientCnxn$SendThread.run(ClientCnxn.java:1214)
    [junit] 2016-12-20 14:32:00,468 [myid:] - INFO  [ProcessThread(sid:0 cport:19545)::PrepRequestProcessor@618]
- Processed session termination for sessionid: 0x101ad16a9a60000
    [junit] 2016-12-20 14:32:00,484 [myid:] - INFO  [main:ZooKeeper@1313] - Session: 0x101ad16a9a60000
closed
    [junit] 2016-12-20 14:32:00,484 [myid:] - INFO  [main-EventThread:ClientCnxn$EventThread@513]
- EventThread shut down for session: 0x101ad16a9a60000
    [junit] 2016-12-20 14:32:00,485 [myid:] - INFO  [main:JUnit4ZKTestRunner$LoggedInvokeMethod@82]
- Memory used 152289
    [junit] 2016-12-20 14:32:00,484 [myid:] - INFO  [SyncThread:0:MBeanRegistry@128] - Unregister
MBean [org.apache.ZooKeeperService:name0=StandaloneServer_port19545,name1=Connections,name2=127.0.0.1,name3=0x101ad16a9a60000]
    [junit] 2016-12-20 14:32:00,485 [myid:] - INFO  [main:JUnit4ZKTestRunner$LoggedInvokeMethod@87]
- Number of threads 1643
    [junit] 2016-12-20 14:32:00,485 [myid:] - INFO  [main:JUnit4ZKTestRunner$LoggedInvokeMethod@102]
- FINISHED TEST METHOD testWatcherAutoResetWithLocal
    [junit] 2016-12-20 14:32:00,485 [myid:] - INFO  [main:ClientBase@543] - tearDown starting
    [junit] 2016-12-20 14:32:00,485 [myid:] - INFO  [main:ClientBase@513] - STOPPING server
    [junit] 2016-12-20 14:32:00,485 [myid:] - INFO  [main:NettyServerCnxnFactory@464] - shutdown
called 0.0.0.0/0.0.0.0:19545
    [junit] 2016-12-20 14:32:00,490 [myid:] - INFO  [main:ZooKeeperServer@534] - shutting
down
    [junit] 2016-12-20 14:32:00,490 [myid:] - ERROR [main:ZooKeeperServer@506] - ZKShutdownHandler
is not registered, so ZooKeeper server won't take any action on ERROR or SHUTDOWN server state
changes
    [junit] 2016-12-20 14:32:00,490 [myid:] - INFO  [main:SessionTrackerImpl@232] - Shutting
down
    [junit] 2016-12-20 14:32:00,490 [myid:] - INFO  [main:PrepRequestProcessor@1009] - Shutting
down
    [junit] 2016-12-20 14:32:00,490 [myid:] - INFO  [main:SyncRequestProcessor@191] - Shutting
down
    [junit] 2016-12-20 14:32:00,490 [myid:] - INFO  [ProcessThread(sid:0 cport:19545)::PrepRequestProcessor@157]
- PrepRequestProcessor exited loop!
    [junit] 2016-12-20 14:32:00,491 [myid:] - INFO  [SyncThread:0:SyncRequestProcessor@169]
- SyncRequestProcessor exited!
    [junit] 2016-12-20 14:32:00,491 [myid:] - INFO  [main:FinalRequestProcessor@481] - shutdown
of request processor complete
    [junit] 2016-12-20 14:32:00,491 [myid:] - INFO  [main:MBeanRegistry@128] - Unregister
MBean [org.apache.ZooKeeperService:name0=StandaloneServer_port19545,name1=InMemoryDataTree]
    [junit] 2016-12-20 14:32:00,491 [myid:] - INFO  [main:MBeanRegistry@128] - Unregister
MBean [org.apache.ZooKeeperService:name0=StandaloneServer_port19545]
    [junit] 2016-12-20 14:32:00,492 [myid:] - INFO  [main:FourLetterWordMain@85] - connecting
to 127.0.0.1 19545
    [junit] 2016-12-20 14:32:00,492 [myid:] - INFO  [main:JMXEnv@146] - ensureOnly:[]
    [junit] 2016-12-20 14:32:00,498 [myid:] - INFO  [main:ClientBase@568] - fdcount after
test is: 4835 at start it was 4831
    [junit] 2016-12-20 14:32:00,498 [myid:] - INFO  [main:ClientBase@570] - sleeping for 20
secs
    [junit] 2016-12-20 14:32:00,498 [myid:] - INFO  [main:ZKTestCase$1@65] - SUCCEEDED testWatcherAutoResetWithLocal
    [junit] 2016-12-20 14:32:00,498 [myid:] - INFO  [main:ZKTestCase$1@60] - FINISHED testWatcherAutoResetWithLocal
    [junit] Tests run: 101, Failures: 0, Errors: 0, Skipped: 0, Time elapsed: 581.589 sec,
Thread: 4, Class: org.apache.zookeeper.test.NioNettySuiteTest

BUILD FAILED
/home/jenkins/jenkins-slave/workspace/ZooKeeper-trunk/build.xml:1324: The following error
occurred while executing this line:
/home/jenkins/jenkins-slave/workspace/ZooKeeper-trunk/build.xml:1209: Tests failed!

Total time: 15 minutes 42 seconds
Build step 'Execute shell' marked build as failure
[FINDBUGS] Skipping publisher since build result is FAILURE
[WARNINGS] Skipping publisher since build result is FAILURE
Archiving artifacts
Setting JDK_1_7_LATEST__HOME=/home/jenkins/tools/java/latest1.7
Recording fingerprints
Setting JDK_1_7_LATEST__HOME=/home/jenkins/tools/java/latest1.7
Updating ZOOKEEPER-2479
Recording test results
Setting JDK_1_7_LATEST__HOME=/home/jenkins/tools/java/latest1.7
Publishing Javadoc
Setting JDK_1_7_LATEST__HOME=/home/jenkins/tools/java/latest1.7
Setting JDK_1_7_LATEST__HOME=/home/jenkins/tools/java/latest1.7
Email was triggered for: Failure - Any
Sending email for trigger: Failure - Any
Setting JDK_1_7_LATEST__HOME=/home/jenkins/tools/java/latest1.7
Setting JDK_1_7_LATEST__HOME=/home/jenkins/tools/java/latest1.7



###################################################################################
############################## FAILED TESTS (if any) ##############################
1 tests failed.
FAILED:  org.apache.zookeeper.server.ZxidRolloverTest.testRolloverThenRestart

Error Message:
Timeout occurred. Please note the time in the report does not reflect the time until the timeout.

Stack Trace:
junit.framework.AssertionFailedError: Timeout occurred. Please note the time in the report
does not reflect the time until the timeout.
	at java.lang.Thread.run(Thread.java:745)



Mime
  • Unnamed multipart/mixed (inline, None, 0 bytes)
View raw message