zookeeper-dev mailing list archives

Site index · List index
Message view « Date » · « Thread »
Top « Date » · « Thread »
From Apache Jenkins Server <jenk...@builds.apache.org>
Subject ZooKeeper_branch35_jdk7 - Build # 765 - Still Failing
Date Tue, 13 Dec 2016 08:53:54 GMT
See https://builds.apache.org/job/ZooKeeper_branch35_jdk7/765/

###################################################################################
########################## LAST 60 LINES OF THE CONSOLE ###########################
[...truncated 452052 lines...]
    [junit] 2016-12-13 08:54:11,167 [myid:] - INFO  [ProcessThread(sid:0 cport:22238)::PrepRequestProcessor@656]
- Processed session termination for sessionid: 0x1010eed56990000
    [junit] 2016-12-13 08:54:11,175 [myid:] - WARN  [New I/O worker #6635:NettyServerCnxnFactory$CnxnChannelHandler@142]
- Exception caught [id: 0x781b409a, /127.0.0.1:37719 :> /127.0.0.1:22238] EXCEPTION: java.nio.channels.ClosedChannelException
    [junit] java.nio.channels.ClosedChannelException
    [junit] 	at sun.nio.ch.SocketChannelImpl.ensureWriteOpen(SocketChannelImpl.java:270)
    [junit] 	at sun.nio.ch.SocketChannelImpl.write(SocketChannelImpl.java:479)
    [junit] 	at org.jboss.netty.channel.socket.nio.SocketSendBufferPool$UnpooledSendBuffer.transferTo(SocketSendBufferPool.java:203)
    [junit] 	at org.jboss.netty.channel.socket.nio.AbstractNioWorker.write0(AbstractNioWorker.java:201)
    [junit] 	at org.jboss.netty.channel.socket.nio.AbstractNioWorker.writeFromTaskLoop(AbstractNioWorker.java:151)
    [junit] 	at org.jboss.netty.channel.socket.nio.AbstractNioChannel$WriteTask.run(AbstractNioChannel.java:315)
    [junit] 	at org.jboss.netty.channel.socket.nio.AbstractNioSelector.processTaskQueue(AbstractNioSelector.java:391)
    [junit] 	at org.jboss.netty.channel.socket.nio.AbstractNioSelector.run(AbstractNioSelector.java:315)
    [junit] 	at org.jboss.netty.channel.socket.nio.AbstractNioWorker.run(AbstractNioWorker.java:89)
    [junit] 	at org.jboss.netty.channel.socket.nio.NioWorker.run(NioWorker.java:178)
    [junit] 	at org.jboss.netty.util.ThreadRenamingRunnable.run(ThreadRenamingRunnable.java:108)
    [junit] 	at org.jboss.netty.util.internal.DeadLockProofWorker$1.run(DeadLockProofWorker.java:42)
    [junit] 	at java.util.concurrent.ThreadPoolExecutor.runWorker(ThreadPoolExecutor.java:1145)
    [junit] 	at java.util.concurrent.ThreadPoolExecutor$Worker.run(ThreadPoolExecutor.java:615)
    [junit] 	at java.lang.Thread.run(Thread.java:745)
    [junit] 2016-12-13 08:54:11,175 [myid:] - INFO  [SyncThread:0:MBeanRegistry@128] - Unregister
MBean [org.apache.ZooKeeperService:name0=StandaloneServer_port22238,name1=Connections,name2=127.0.0.1,name3=0x1010eed56990000]
    [junit] 2016-12-13 08:54:11,275 [myid:] - INFO  [main:ZooKeeper@1311] - Session: 0x1010eed56990000
closed
    [junit] 2016-12-13 08:54:11,275 [myid:] - INFO  [main-EventThread:ClientCnxn$EventThread@513]
- EventThread shut down for session: 0x1010eed56990000
    [junit] 2016-12-13 08:54:11,275 [myid:] - INFO  [main:JUnit4ZKTestRunner$LoggedInvokeMethod@82]
- Memory used 202774
    [junit] 2016-12-13 08:54:11,276 [myid:] - INFO  [main:JUnit4ZKTestRunner$LoggedInvokeMethod@87]
- Number of threads 1642
    [junit] 2016-12-13 08:54:11,276 [myid:] - INFO  [main:JUnit4ZKTestRunner$LoggedInvokeMethod@102]
- FINISHED TEST METHOD testWatcherAutoResetWithLocal
    [junit] 2016-12-13 08:54:11,276 [myid:] - INFO  [main:ClientBase@543] - tearDown starting
    [junit] 2016-12-13 08:54:11,276 [myid:] - INFO  [main:ClientBase@513] - STOPPING server
    [junit] 2016-12-13 08:54:11,276 [myid:] - INFO  [main:NettyServerCnxnFactory@464] - shutdown
called 0.0.0.0/0.0.0.0:22238
    [junit] 2016-12-13 08:54:11,284 [myid:] - INFO  [main:ZooKeeperServer@533] - shutting
down
    [junit] 2016-12-13 08:54:11,287 [myid:] - ERROR [main:ZooKeeperServer@505] - ZKShutdownHandler
is not registered, so ZooKeeper server won't take any action on ERROR or SHUTDOWN server state
changes
    [junit] 2016-12-13 08:54:11,287 [myid:] - INFO  [main:SessionTrackerImpl@232] - Shutting
down
    [junit] 2016-12-13 08:54:11,287 [myid:] - INFO  [main:PrepRequestProcessor@974] - Shutting
down
    [junit] 2016-12-13 08:54:11,287 [myid:] - INFO  [main:SyncRequestProcessor@191] - Shutting
down
    [junit] 2016-12-13 08:54:11,287 [myid:] - INFO  [SyncThread:0:SyncRequestProcessor@169]
- SyncRequestProcessor exited!
    [junit] 2016-12-13 08:54:11,287 [myid:] - INFO  [ProcessThread(sid:0 cport:22238)::PrepRequestProcessor@154]
- PrepRequestProcessor exited loop!
    [junit] 2016-12-13 08:54:11,287 [myid:] - INFO  [main:FinalRequestProcessor@479] - shutdown
of request processor complete
    [junit] 2016-12-13 08:54:11,288 [myid:] - INFO  [main:MBeanRegistry@128] - Unregister
MBean [org.apache.ZooKeeperService:name0=StandaloneServer_port22238,name1=InMemoryDataTree]
    [junit] 2016-12-13 08:54:11,288 [myid:] - INFO  [main:MBeanRegistry@128] - Unregister
MBean [org.apache.ZooKeeperService:name0=StandaloneServer_port22238]
    [junit] 2016-12-13 08:54:11,288 [myid:] - INFO  [main:FourLetterWordMain@85] - connecting
to 127.0.0.1 22238
    [junit] 2016-12-13 08:54:11,289 [myid:] - INFO  [main:JMXEnv@146] - ensureOnly:[]
    [junit] 2016-12-13 08:54:11,295 [myid:] - INFO  [main:ClientBase@568] - fdcount after
test is: 4835 at start it was 4835
    [junit] 2016-12-13 08:54:11,295 [myid:] - INFO  [main:ZKTestCase$1@65] - SUCCEEDED testWatcherAutoResetWithLocal
    [junit] 2016-12-13 08:54:11,295 [myid:] - INFO  [main:ZKTestCase$1@60] - FINISHED testWatcherAutoResetWithLocal
    [junit] Tests run: 101, Failures: 0, Errors: 0, Skipped: 0, Time elapsed: 581.842 sec,
Thread: 5, Class: org.apache.zookeeper.test.NioNettySuiteTest
    [junit] 2016-12-13 08:54:11,501 [myid:127.0.0.1:22118] - INFO  [main-SendThread(127.0.0.1:22118):ClientCnxn$SendThread@1113]
- Opening socket connection to server 127.0.0.1/127.0.0.1:22118. Will not attempt to authenticate
using SASL (unknown error)
    [junit] 2016-12-13 08:54:11,502 [myid:127.0.0.1:22118] - WARN  [main-SendThread(127.0.0.1:22118):ClientCnxn$SendThread@1235]
- Session 0x2010ee9ffea0000 for server 127.0.0.1/127.0.0.1:22118, unexpected error, closing
socket connection and attempting reconnect
    [junit] java.net.ConnectException: Connection refused
    [junit] 	at sun.nio.ch.SocketChannelImpl.checkConnect(Native Method)
    [junit] 	at sun.nio.ch.SocketChannelImpl.finishConnect(SocketChannelImpl.java:744)
    [junit] 	at org.apache.zookeeper.ClientCnxnSocketNIO.doTransport(ClientCnxnSocketNIO.java:357)
    [junit] 	at org.apache.zookeeper.ClientCnxn$SendThread.run(ClientCnxn.java:1214)

BUILD FAILED
/home/jenkins/jenkins-slave/workspace/ZooKeeper_branch35_jdk7/build.xml:1208: Tests failed!

Total time: 14 minutes 55 seconds
Build step 'Invoke Ant' marked build as failure
Recording test results
Email was triggered for: Failure - Any
Sending email for trigger: Failure - Any



###################################################################################
############################## FAILED TESTS (if any) ##############################
4 tests failed.
FAILED:  org.apache.zookeeper.server.quorum.ReconfigDuringLeaderSyncTest.testDuringLeaderSync

Error Message:
zoo.cfg.dynamic.next is not deleted.

Stack Trace:
junit.framework.AssertionFailedError: zoo.cfg.dynamic.next is not deleted.
	at org.apache.zookeeper.server.quorum.ReconfigDuringLeaderSyncTest.testDuringLeaderSync(ReconfigDuringLeaderSyncTest.java:165)
	at org.apache.zookeeper.JUnit4ZKTestRunner$LoggedInvokeMethod.evaluate(JUnit4ZKTestRunner.java:79)


FAILED:  org.apache.zookeeper.server.quorum.ReconfigRecoveryTest.testCurrentServersAreObserversInNextConfig

Error Message:
waiting for server 0 being up

Stack Trace:
junit.framework.AssertionFailedError: waiting for server 0 being up
	at org.apache.zookeeper.server.quorum.ReconfigRecoveryTest.testCurrentServersAreObserversInNextConfig(ReconfigRecoveryTest.java:217)
	at org.apache.zookeeper.JUnit4ZKTestRunner$LoggedInvokeMethod.evaluate(JUnit4ZKTestRunner.java:79)


FAILED:  org.apache.zookeeper.test.LeaderSessionTrackerTest.testExpiredSessionWithoutLocalSession

Error Message:
waiting for server up

Stack Trace:
junit.framework.AssertionFailedError: waiting for server up
	at org.apache.zookeeper.test.QuorumUtil.startAll(QuorumUtil.java:151)
	at org.apache.zookeeper.test.LeaderSessionTrackerTest.testCreateEphemeral(LeaderSessionTrackerTest.java:88)
	at org.apache.zookeeper.test.LeaderSessionTrackerTest.testExpiredSessionWithoutLocalSession(LeaderSessionTrackerTest.java:73)
	at org.apache.zookeeper.JUnit4ZKTestRunner$LoggedInvokeMethod.evaluate(JUnit4ZKTestRunner.java:79)


FAILED:  org.apache.zookeeper.test.NonRecoverableErrorTest.testZooKeeperServiceAvailableOnLeader

Error Message:
test timed out after 30000 milliseconds

Stack Trace:
org.junit.runners.model.TestTimedOutException: test timed out after 30000 milliseconds
	at java.lang.Thread.sleep(Native Method)
	at org.apache.zookeeper.test.ClientBase.waitForServerUp(ClientBase.java:257)
	at org.apache.zookeeper.test.ClientBase.waitForServerUp(ClientBase.java:232)
	at org.apache.zookeeper.test.NonRecoverableErrorTest.testZooKeeperServiceAvailableOnLeader(NonRecoverableErrorTest.java:77)
	at org.apache.zookeeper.JUnit4ZKTestRunner$LoggedInvokeMethod.evaluate(JUnit4ZKTestRunner.java:79)
	at java.util.concurrent.FutureTask.run(FutureTask.java:262)
	at java.lang.Thread.run(Thread.java:745)



Mime
  • Unnamed multipart/mixed (inline, None, 0 bytes)
View raw message