zookeeper-dev mailing list archives

Site index · List index
Message view « Date » · « Thread »
Top « Date » · « Thread »
From Apache Jenkins Server <jenk...@builds.apache.org>
Subject ZooKeeper-trunk-jdk8 - Build # 879 - Still Failing
Date Fri, 30 Dec 2016 12:02:13 GMT
See https://builds.apache.org/job/ZooKeeper-trunk-jdk8/879/

###################################################################################
########################## LAST 60 LINES OF THE CONSOLE ###########################
[...truncated 463240 lines...]
    [junit] 2016-12-30 11:59:49,018 [myid:] - INFO  [main:PrepRequestProcessor@1009] - Shutting
down
    [junit] 2016-12-30 11:59:49,018 [myid:] - INFO  [main:SyncRequestProcessor@191] - Shutting
down
    [junit] 2016-12-30 11:59:49,018 [myid:] - INFO  [SyncThread:0:SyncRequestProcessor@169]
- SyncRequestProcessor exited!
    [junit] 2016-12-30 11:59:49,018 [myid:] - INFO  [ProcessThread(sid:0 cport:24931)::PrepRequestProcessor@157]
- PrepRequestProcessor exited loop!
    [junit] 2016-12-30 11:59:49,019 [myid:] - INFO  [main:FinalRequestProcessor@481] - shutdown
of request processor complete
    [junit] 2016-12-30 11:59:49,019 [myid:] - INFO  [main:MBeanRegistry@128] - Unregister
MBean [org.apache.ZooKeeperService:name0=StandaloneServer_port24931,name1=InMemoryDataTree]
    [junit] 2016-12-30 11:59:49,019 [myid:] - INFO  [main:MBeanRegistry@128] - Unregister
MBean [org.apache.ZooKeeperService:name0=StandaloneServer_port24931]
    [junit] 2016-12-30 11:59:49,019 [myid:] - INFO  [main:FourLetterWordMain@85] - connecting
to 127.0.0.1 24931
    [junit] 2016-12-30 11:59:49,020 [myid:] - INFO  [main:JMXEnv@146] - ensureOnly:[]
    [junit] 2016-12-30 11:59:49,027 [myid:] - INFO  [main:ClientBase@568] - fdcount after
test is: 4836 at start it was 4832
    [junit] 2016-12-30 11:59:49,027 [myid:] - INFO  [main:ClientBase@570] - sleeping for 20
secs
    [junit] 2016-12-30 11:59:49,028 [myid:] - INFO  [main:ZKTestCase$1@65] - SUCCEEDED testWatcherAutoResetWithLocal
    [junit] 2016-12-30 11:59:49,028 [myid:] - INFO  [main:ZKTestCase$1@60] - FINISHED testWatcherAutoResetWithLocal
    [junit] Tests run: 101, Failures: 0, Errors: 0, Skipped: 0, Time elapsed: 594.435 sec,
Thread: 6, Class: org.apache.zookeeper.test.NioNettySuiteTest
    [junit] 2016-12-30 12:01:44,755 [myid:] - INFO  [main:JUnit4ZKTestRunner$LoggedInvokeMethod@82]
- Memory used 135012
    [junit] 2016-12-30 12:01:44,756 [myid:] - INFO  [main:JUnit4ZKTestRunner$LoggedInvokeMethod@87]
- Number of threads 55
    [junit] 2016-12-30 12:01:44,756 [myid:] - INFO  [main:JUnit4ZKTestRunner$LoggedInvokeMethod@102]
- FINISHED TEST METHOD testManyChildWatchersAutoReset
    [junit] 2016-12-30 12:01:44,756 [myid:] - INFO  [main:ClientBase@543] - tearDown starting
    [junit] 2016-12-30 12:01:44,758 [myid:] - INFO  [ProcessThread(sid:0 cport:13918)::PrepRequestProcessor@618]
- Processed session termination for sessionid: 0x101e345348c0000
    [junit] 2016-12-30 12:01:44,797 [myid:] - INFO  [main:ZooKeeper@1313] - Session: 0x101e345348c0000
closed
    [junit] 2016-12-30 12:01:44,797 [myid:] - INFO  [NIOWorkerThread-29:MBeanRegistry@128]
- Unregister MBean [org.apache.ZooKeeperService:name0=StandaloneServer_port13918,name1=Connections,name2=127.0.0.1,name3=0x101e345348c0000]
    [junit] 2016-12-30 12:01:44,797 [myid:] - INFO  [main-EventThread:ClientCnxn$EventThread@513]
- EventThread shut down for session: 0x101e345348c0000
    [junit] 2016-12-30 12:01:44,798 [myid:] - INFO  [ProcessThread(sid:0 cport:13918)::PrepRequestProcessor@618]
- Processed session termination for sessionid: 0x101e345348c0001
    [junit] 2016-12-30 12:01:44,799 [myid:] - INFO  [NIOWorkerThread-29:NIOServerCnxn@614]
- Closed socket connection for client /127.0.0.1:48808 which had sessionid 0x101e345348c0000
    [junit] 2016-12-30 12:01:44,864 [myid:] - INFO  [NIOWorkerThread-10:MBeanRegistry@128]
- Unregister MBean [org.apache.ZooKeeperService:name0=StandaloneServer_port13918,name1=Connections,name2=127.0.0.1,name3=0x101e345348c0001]
    [junit] 2016-12-30 12:01:44,864 [myid:] - INFO  [main:ZooKeeper@1313] - Session: 0x101e345348c0001
closed
    [junit] 2016-12-30 12:01:44,864 [myid:] - INFO  [NIOWorkerThread-10:NIOServerCnxn@614]
- Closed socket connection for client /127.0.0.1:48823 which had sessionid 0x101e345348c0001
    [junit] 2016-12-30 12:01:44,864 [myid:] - INFO  [main-EventThread:ClientCnxn$EventThread@513]
- EventThread shut down for session: 0x101e345348c0001
    [junit] 2016-12-30 12:01:44,864 [myid:] - INFO  [main:ClientBase@513] - STOPPING server
    [junit] 2016-12-30 12:01:44,865 [myid:] - INFO  [ConnnectionExpirer:NIOServerCnxnFactory$ConnectionExpirerThread@583]
- ConnnectionExpirerThread interrupted
    [junit] 2016-12-30 12:01:44,868 [myid:] - INFO  [NIOServerCxnFactory.AcceptThread:0.0.0.0/0.0.0.0:13918:NIOServerCnxnFactory$AcceptThread@219]
- accept thread exitted run method
    [junit] 2016-12-30 12:01:44,869 [myid:] - INFO  [NIOServerCxnFactory.SelectorThread-1:NIOServerCnxnFactory$SelectorThread@420]
- selector thread exitted run method
    [junit] 2016-12-30 12:01:44,870 [myid:] - INFO  [NIOServerCxnFactory.SelectorThread-0:NIOServerCnxnFactory$SelectorThread@420]
- selector thread exitted run method
    [junit] 2016-12-30 12:01:44,872 [myid:] - INFO  [main:ZooKeeperServer@534] - shutting
down
    [junit] 2016-12-30 12:01:44,872 [myid:] - ERROR [main:ZooKeeperServer@506] - ZKShutdownHandler
is not registered, so ZooKeeper server won't take any action on ERROR or SHUTDOWN server state
changes
    [junit] 2016-12-30 12:01:44,872 [myid:] - INFO  [main:SessionTrackerImpl@232] - Shutting
down
    [junit] 2016-12-30 12:01:44,872 [myid:] - INFO  [main:PrepRequestProcessor@1009] - Shutting
down
    [junit] 2016-12-30 12:01:44,873 [myid:] - INFO  [main:SyncRequestProcessor@191] - Shutting
down
    [junit] 2016-12-30 12:01:44,873 [myid:] - INFO  [ProcessThread(sid:0 cport:13918)::PrepRequestProcessor@157]
- PrepRequestProcessor exited loop!
    [junit] 2016-12-30 12:01:44,873 [myid:] - INFO  [SyncThread:0:SyncRequestProcessor@169]
- SyncRequestProcessor exited!
    [junit] 2016-12-30 12:01:44,873 [myid:] - INFO  [main:FinalRequestProcessor@481] - shutdown
of request processor complete
    [junit] 2016-12-30 12:01:44,873 [myid:] - INFO  [main:MBeanRegistry@128] - Unregister
MBean [org.apache.ZooKeeperService:name0=StandaloneServer_port13918,name1=InMemoryDataTree]
    [junit] 2016-12-30 12:01:44,874 [myid:] - INFO  [main:MBeanRegistry@128] - Unregister
MBean [org.apache.ZooKeeperService:name0=StandaloneServer_port13918]
    [junit] 2016-12-30 12:01:44,874 [myid:] - INFO  [main:FourLetterWordMain@85] - connecting
to 127.0.0.1 13918
    [junit] 2016-12-30 12:01:44,875 [myid:] - INFO  [main:JMXEnv@146] - ensureOnly:[]
    [junit] 2016-12-30 12:01:44,880 [myid:] - INFO  [main:ClientBase@568] - fdcount after
test is: 57 at start it was 57
    [junit] 2016-12-30 12:01:44,880 [myid:] - INFO  [main:ZKTestCase$1@65] - SUCCEEDED testManyChildWatchersAutoReset
    [junit] 2016-12-30 12:01:44,880 [myid:] - INFO  [main:ZKTestCase$1@60] - FINISHED testManyChildWatchersAutoReset
    [junit] Tests run: 4, Failures: 0, Errors: 0, Skipped: 0, Time elapsed: 830.847 sec, Thread:
2, Class: org.apache.zookeeper.test.DisconnectedWatcherTest

BUILD FAILED
/home/jenkins/jenkins-slave/workspace/ZooKeeper-trunk-jdk8/build.xml:1209: Tests failed!

Total time: 17 minutes 46 seconds
Build step 'Invoke Ant' marked build as failure
[WARNINGS] Skipping publisher since build result is FAILURE
Recording test results
Email was triggered for: Failure - Any
Sending email for trigger: Failure - Any



###################################################################################
############################## FAILED TESTS (if any) ##############################
2 tests failed.
FAILED:  org.apache.zookeeper.test.WatcherTest.testWatchAutoResetWithPending

Error Message:
For 64 expected:<1> but was:<0>

Stack Trace:
junit.framework.AssertionFailedError: For 64 expected:<1> but was:<0>
	at org.apache.zookeeper.test.WatcherTest.testWatchAutoResetWithPending(WatcherTest.java:215)
	at org.apache.zookeeper.JUnit4ZKTestRunner$LoggedInvokeMethod.evaluate(JUnit4ZKTestRunner.java:79)


FAILED:  org.apache.zookeeper.server.quorum.ReconfigFailureCasesTest.testLeaderTimesoutOnNewQuorum

Error Message:
expected:<[leaderelection]> but was:<[following]>

Stack Trace:
junit.framework.AssertionFailedError: expected:<[leaderelection]> but was:<[following]>
	at org.apache.zookeeper.server.quorum.ReconfigFailureCasesTest.testLeaderTimesoutOnNewQuorum(ReconfigFailureCasesTest.java:197)
	at org.apache.zookeeper.JUnit4ZKTestRunner$LoggedInvokeMethod.evaluate(JUnit4ZKTestRunner.java:79)



Mime
  • Unnamed multipart/mixed (inline, None, 0 bytes)
View raw message