zookeeper-dev mailing list archives

Site index · List index
Message view « Date » · « Thread »
Top « Date » · « Thread »
From Apache Jenkins Server <jenk...@builds.apache.org>
Subject ZooKeeper-trunk-solaris - Build # 1409 - Still Failing
Date Sat, 03 Dec 2016 18:11:20 GMT
See https://builds.apache.org/job/ZooKeeper-trunk-solaris/1409/

###################################################################################
########################## LAST 60 LINES OF THE CONSOLE ###########################
[...truncated 46228 lines...]
    [junit] java.net.ConnectException: Connection refused
    [junit] 	at sun.nio.ch.Net.connect0(Native Method)
    [junit] 	at sun.nio.ch.Net.connect(Net.java:465)
    [junit] 	at sun.nio.ch.Net.connect(Net.java:457)
    [junit] 	at sun.nio.ch.SocketChannelImpl.connect(SocketChannelImpl.java:670)
    [junit] 	at org.apache.zookeeper.ClientCnxnSocketNIO.registerAndConnect(ClientCnxnSocketNIO.java:275)
    [junit] 	at org.apache.zookeeper.ClientCnxnSocketNIO.connect(ClientCnxnSocketNIO.java:285)
    [junit] 	at org.apache.zookeeper.ClientCnxn$SendThread.startConnect(ClientCnxn.java:1098)
    [junit] 	at org.apache.zookeeper.ClientCnxn$SendThread.run(ClientCnxn.java:1133)
    [junit] 2016-12-03 18:11:38,481 [myid:127.0.0.1:11243] - INFO  [main-SendThread(127.0.0.1:11243):ClientCnxn$SendThread@1113]
- Opening socket connection to server 127.0.0.1/127.0.0.1:11243. Will not attempt to authenticate
using SASL (unknown error)
    [junit] 2016-12-03 18:11:38,481 [myid:127.0.0.1:11243] - ERROR [main-SendThread(127.0.0.1:11243):ClientCnxnSocketNIO@287]
- Unable to open socket to 127.0.0.1/127.0.0.1:11243
    [junit] 2016-12-03 18:11:38,481 [myid:127.0.0.1:11243] - WARN  [main-SendThread(127.0.0.1:11243):ClientCnxn$SendThread@1235]
- Session 0x2542db11fb0000 for server null, unexpected error, closing socket connection and
attempting reconnect
    [junit] java.net.ConnectException: Connection refused
    [junit] 	at sun.nio.ch.Net.connect0(Native Method)
    [junit] 	at sun.nio.ch.Net.connect(Net.java:465)
    [junit] 	at sun.nio.ch.Net.connect(Net.java:457)
    [junit] 	at sun.nio.ch.SocketChannelImpl.connect(SocketChannelImpl.java:670)
    [junit] 	at org.apache.zookeeper.ClientCnxnSocketNIO.registerAndConnect(ClientCnxnSocketNIO.java:275)
    [junit] 	at org.apache.zookeeper.ClientCnxnSocketNIO.connect(ClientCnxnSocketNIO.java:285)
    [junit] 	at org.apache.zookeeper.ClientCnxn$SendThread.startConnect(ClientCnxn.java:1098)
    [junit] 	at org.apache.zookeeper.ClientCnxn$SendThread.run(ClientCnxn.java:1133)
    [junit] Tests run: 10, Failures: 0, Errors: 0, Time elapsed: 153.273 sec
    [junit] 2016-12-03 18:11:38,641 [myid:1] - INFO  [WorkerSender[myid=1]:FastLeaderElection$Messenger$WorkerSender@470]
- WorkerSender is down
    [junit] 2016-12-03 18:11:38,641 [myid:1] - INFO  [WorkerReceiver[myid=1]:FastLeaderElection$Messenger$WorkerReceiver@440]
- WorkerReceiver is down
    [junit] Running org.apache.zookeeper.server.quorum.QuorumPeerTest
    [junit] 2016-12-03 18:12:16,887 [myid:] - INFO  [main:PortAssignment@157] - Single test
process using ports from 11221 - 32767.
    [junit] 2016-12-03 18:12:17,089 [myid:] - INFO  [main:PortAssignment@85] - Assigned port
11222 from range 11221 - 32767.
    [junit] 2016-12-03 18:12:17,447 [myid:] - INFO  [main:PortAssignment@85] - Assigned port
11223 from range 11221 - 32767.
    [junit] 2016-12-03 18:12:17,447 [myid:] - INFO  [main:PortAssignment@85] - Assigned port
11224 from range 11221 - 32767.
    [junit] 2016-12-03 18:12:19,545 [myid:] - INFO  [main:NIOServerCnxnFactory@673] - Configuring
NIO connection handler with 10s sessionless connection timeout, 2 selector thread(s), 16 worker
threads, and 64 kB direct buffers.
    [junit] 2016-12-03 18:12:19,715 [myid:] - INFO  [main:NIOServerCnxnFactory@686] - binding
to port localhost/127.0.0.1:11222
    [junit] 2016-12-03 18:12:21,020 [myid:] - INFO  [main:Log@186] - Logging initialized @25504ms
    [junit] 2016-12-03 18:12:22,696 [myid:] - WARN  [main:ContextHandler@1339] - o.e.j.s.ServletContextHandler@12a9118{/,null,null}
contextPath ends with /*
    [junit] 2016-12-03 18:12:22,696 [myid:] - WARN  [main:ContextHandler@1350] - Empty contextPath
    [junit] 2016-12-03 18:12:23,412 [myid:] - WARN  [main:ContextHandler@1339] - o.e.j.s.ServletContextHandler@146fac0{/,null,null}
contextPath ends with /*
    [junit] 2016-12-03 18:12:23,412 [myid:] - WARN  [main:ContextHandler@1350] - Empty contextPath
    [junit] 2016-12-03 18:12:23,432 [myid:] - INFO  [main:PortAssignment@85] - Assigned port
11225 from range 11221 - 32767.
    [junit] 2016-12-03 18:12:23,432 [myid:] - INFO  [main:PortAssignment@85] - Assigned port
11226 from range 11221 - 32767.
    [junit] 2016-12-03 18:12:23,432 [myid:] - INFO  [main:PortAssignment@85] - Assigned port
11227 from range 11221 - 32767.
    [junit] 2016-12-03 18:12:23,433 [myid:] - INFO  [main:NIOServerCnxnFactory@673] - Configuring
NIO connection handler with 10s sessionless connection timeout, 2 selector thread(s), 16 worker
threads, and 64 kB direct buffers.
    [junit] 2016-12-03 18:12:23,433 [myid:] - INFO  [main:NIOServerCnxnFactory@686] - binding
to port localhost/127.0.0.1:11225
    [junit] 2016-12-03 18:12:23,435 [myid:] - WARN  [main:ContextHandler@1339] - o.e.j.s.ServletContextHandler@14f95bf{/,null,null}
contextPath ends with /*
    [junit] 2016-12-03 18:12:23,435 [myid:] - WARN  [main:ContextHandler@1350] - Empty contextPath
    [junit] 2016-12-03 18:12:23,437 [myid:] - WARN  [main:ContextHandler@1339] - o.e.j.s.ServletContextHandler@165b2e4{/,null,null}
contextPath ends with /*
    [junit] 2016-12-03 18:12:23,437 [myid:] - WARN  [main:ContextHandler@1350] - Empty contextPath
    [junit] Tests run: 1, Failures: 0, Errors: 0, Time elapsed: 19.617 sec
    [junit] Running org.apache.zookeeper.server.quorum.QuorumRequestPipelineTest
    [junit] Tests run: 1, Failures: 0, Errors: 1, Time elapsed: 0 sec

BUILD FAILED
/zonestorage/hudson_solaris/home/hudson/hudson-slave/workspace/ZooKeeper-trunk-solaris/build.xml:1221:
Process fork failed.

Total time: 34 minutes 28 seconds
Build step 'Invoke Ant' marked build as failure
[locks-and-latches] Releasing all the locks
[locks-and-latches] All the locks released
Recording test results
Email was triggered for: Failure - Any
Sending email for trigger: Failure - Any



###################################################################################
############################## FAILED TESTS (if any) ##############################
1 tests failed.
FAILED:  org.apache.zookeeper.server.quorum.QuorumRequestPipelineTest.unknown

Error Message:
Forked Java VM exited abnormally. Please note the time in the report does not reflect the
time until the VM exit.

Stack Trace:
junit.framework.AssertionFailedError: Forked Java VM exited abnormally. Please note the time
in the report does not reflect the time until the VM exit.



Mime
  • Unnamed multipart/mixed (inline, None, 0 bytes)
View raw message