zookeeper-dev mailing list archives

Site index · List index
Message view « Date » · « Thread »
Top « Date » · « Thread »
From Apache Jenkins Server <jenk...@builds.apache.org>
Subject Failed: ZOOKEEPER- PreCommit Build #100
Date Mon, 05 Dec 2016 17:47:24 GMT
Build: https://builds.apache.org/job/PreCommit-ZOOKEEPER-github-pr-build/100/

###################################################################################
########################## LAST 60 LINES OF THE CONSOLE ###########################
[...truncated 443498 lines...]
     [exec] 
     [exec]     +1 javadoc.  The javadoc tool did not generate any warning messages.
     [exec] 
     [exec]     +1 javac.  The applied patch does not increase the total number of javac compiler
warnings.
     [exec] 
     [exec]     +1 findbugs.  The patch does not introduce any new Findbugs (version 3.0.1)
warnings.
     [exec] 
     [exec]     +1 release audit.  The applied patch does not increase the total number of
release audit warnings.
     [exec] 
     [exec]     -1 core tests.  The patch failed core unit tests.
     [exec] 
     [exec]     +1 contrib tests.  The patch passed contrib unit tests.
     [exec] 
     [exec] Test results: https://builds.apache.org/job/PreCommit-ZOOKEEPER-github-pr-build/100//testReport/
     [exec] Findbugs warnings: https://builds.apache.org/job/PreCommit-ZOOKEEPER-github-pr-build/100//artifact/trunk/build/test/findbugs/newPatchFindbugsWarnings.html
     [exec] Console output: https://builds.apache.org/job/PreCommit-ZOOKEEPER-github-pr-build/100//console
     [exec] 
     [exec] This message is automatically generated.
     [exec] 
     [exec] 
     [exec] ======================================================================
     [exec] ======================================================================
     [exec]     Adding comment to Jira.
     [exec] ======================================================================
     [exec] ======================================================================
     [exec] 
     [exec] 
     [exec] Comment added.
     [exec] 1986487309e8642d2206f6dc09553c8424b2ea3b logged out
     [exec] 
     [exec] 
     [exec] ======================================================================
     [exec] ======================================================================
     [exec]     Finished build.
     [exec] ======================================================================
     [exec] ======================================================================
     [exec] 
     [exec] 
     [exec] mv: '/home/jenkins/jenkins-slave/workspace/PreCommit-ZOOKEEPER-github-pr-build/patchprocess'
and '/home/jenkins/jenkins-slave/workspace/PreCommit-ZOOKEEPER-github-pr-build/patchprocess'
are the same file

BUILD FAILED
/home/jenkins/jenkins-slave/workspace/PreCommit-ZOOKEEPER-github-pr-build/build.xml:1628:
exec returned: 1

Total time: 18 minutes 49 seconds
Build step 'Execute shell' marked build as failure
Archiving artifacts
Setting JDK_1_7_LATEST__HOME=/home/jenkins/tools/java/latest1.7
Compressed 573.70 KB of artifacts by 44.6% relative to #95
Recording test results
Setting JDK_1_7_LATEST__HOME=/home/jenkins/tools/java/latest1.7
Setting JDK_1_7_LATEST__HOME=/home/jenkins/tools/java/latest1.7
[description-setter] Description set: ZOOKEEPER-2080
Putting comment on the pull request
Setting JDK_1_7_LATEST__HOME=/home/jenkins/tools/java/latest1.7
Email was triggered for: Failure - Any
Sending email for trigger: Failure - Any
Setting JDK_1_7_LATEST__HOME=/home/jenkins/tools/java/latest1.7
Setting JDK_1_7_LATEST__HOME=/home/jenkins/tools/java/latest1.7
Setting JDK_1_7_LATEST__HOME=/home/jenkins/tools/java/latest1.7



###################################################################################
############################## FAILED TESTS (if any) ##############################
6 tests failed.
FAILED:  org.apache.zookeeper.test.FLEZeroWeightTest.testZeroWeightQuorum

Error Message:
Threads didn't join

Stack Trace:
junit.framework.AssertionFailedError: Threads didn't join
	at org.apache.zookeeper.test.FLEZeroWeightTest.testZeroWeightQuorum(FLEZeroWeightTest.java:167)
	at org.apache.zookeeper.JUnit4ZKTestRunner$LoggedInvokeMethod.evaluate(JUnit4ZKTestRunner.java:79)


FAILED:  org.apache.zookeeper.test.LETest.testLE

Error Message:
Threads didn't join

Stack Trace:
junit.framework.AssertionFailedError: Threads didn't join
	at org.apache.zookeeper.test.LETest.testLE(LETest.java:123)
	at org.apache.zookeeper.JUnit4ZKTestRunner$LoggedInvokeMethod.evaluate(JUnit4ZKTestRunner.java:79)


FAILED:  org.apache.zookeeper.test.QuorumTest.testNoLogBeforeLeaderEstablishment

Error Message:
Not following

Stack Trace:
junit.framework.AssertionFailedError: Not following
	at org.apache.zookeeper.test.QuorumTest.testNoLogBeforeLeaderEstablishment(QuorumTest.java:411)
	at org.apache.zookeeper.JUnit4ZKTestRunner$LoggedInvokeMethod.evaluate(JUnit4ZKTestRunner.java:79)


FAILED:  org.apache.zookeeper.test.QuorumZxidSyncTest.testBehindLeader

Error Message:
Servers didn't come up

Stack Trace:
junit.framework.AssertionFailedError: Servers didn't come up
	at org.apache.zookeeper.test.QuorumZxidSyncTest.testBehindLeader(QuorumZxidSyncTest.java:87)
	at org.apache.zookeeper.JUnit4ZKTestRunner$LoggedInvokeMethod.evaluate(JUnit4ZKTestRunner.java:79)


FAILED:  org.apache.zookeeper.test.SessionUpgradeTest.testLocalSessionsWithoutEphemeralOnFollower

Error Message:
waiting for server up

Stack Trace:
junit.framework.AssertionFailedError: waiting for server up
	at org.apache.zookeeper.test.QuorumBase.startServers(QuorumBase.java:223)
	at org.apache.zookeeper.test.QuorumBase.setUp(QuorumBase.java:120)
	at org.apache.zookeeper.test.QuorumBase.setUp(QuorumBase.java:78)
	at org.apache.zookeeper.test.SessionUpgradeTest.setUp(SessionUpgradeTest.java:52)


FAILED:  org.apache.zookeeper.test.WatcherTest.testWatcherAutoResetWithGlobal

Error Message:
Failed to connect to ZooKeeper server.

Stack Trace:
java.util.concurrent.TimeoutException: Failed to connect to ZooKeeper server.
	at org.apache.zookeeper.test.ClientBase$CountdownWatcher.waitForConnected(ClientBase.java:132)
	at org.apache.zookeeper.test.WatcherTest.testWatcherAutoReset(WatcherTest.java:283)
	at org.apache.zookeeper.test.WatcherTest.testWatcherAutoResetWithGlobal(WatcherTest.java:231)
	at org.apache.zookeeper.JUnit4ZKTestRunner$LoggedInvokeMethod.evaluate(JUnit4ZKTestRunner.java:79)



Mime
  • Unnamed multipart/mixed (inline, None, 0 bytes)
View raw message