zookeeper-dev mailing list archives

Site index · List index
Message view « Date » · « Thread »
Top « Date » · « Thread »
From Apache Jenkins Server <jenk...@builds.apache.org>
Subject ZooKeeper_branch34_solaris - Build # 1413 - Still Failing
Date Sat, 31 Dec 2016 13:26:21 GMT
See https://builds.apache.org/job/ZooKeeper_branch34_solaris/1413/

###################################################################################
########################## LAST 60 LINES OF THE CONSOLE ###########################
[...truncated 141 lines...]
    [javac]                 ^
    [javac] /zonestorage/hudson_solaris/home/hudson/hudson-slave/workspace/ZooKeeper_branch34_solaris/src/java/main/org/apache/zookeeper/server/quorum/QuorumPeer.java:766:
warning: [deprecation] org.apache.zookeeper.server.quorum.LeaderElection in org.apache.zookeeper.server.quorum
has been deprecated
    [javac]             le = new LeaderElection(this);
    [javac]                      ^
    [javac] /zonestorage/hudson_solaris/home/hudson/hudson-slave/workspace/ZooKeeper_branch34_solaris/src/java/main/org/apache/zookeeper/server/quorum/QuorumPeer.java:769:
warning: [deprecation] org.apache.zookeeper.server.quorum.AuthFastLeaderElection in org.apache.zookeeper.server.quorum
has been deprecated
    [javac]             le = new AuthFastLeaderElection(this);
    [javac]                      ^
    [javac] /zonestorage/hudson_solaris/home/hudson/hudson-slave/workspace/ZooKeeper_branch34_solaris/src/java/main/org/apache/zookeeper/server/quorum/QuorumPeer.java:772:
warning: [deprecation] org.apache.zookeeper.server.quorum.AuthFastLeaderElection in org.apache.zookeeper.server.quorum
has been deprecated
    [javac]             le = new AuthFastLeaderElection(this, true);
    [javac]                      ^
    [javac] /zonestorage/hudson_solaris/home/hudson/hudson-slave/workspace/ZooKeeper_branch34_solaris/src/java/main/org/apache/zookeeper/server/quorum/QuorumPeer.java:793:
warning: [deprecation] org.apache.zookeeper.server.quorum.LeaderElection in org.apache.zookeeper.server.quorum
has been deprecated
    [javac]             electionAlg = new LeaderElection(this);
    [javac]                               ^
    [javac] 5 warnings

jar:

BUILD FAILED
/zonestorage/hudson_solaris/home/hudson/hudson-slave/workspace/ZooKeeper_branch34_solaris/build.xml:535:
java.io.IOException: Cannot run program "/zonestorage/hudson_solaris/home/hudson/hudson-slave/tools/jdk6-u26-auto-install/jre/bin/java":
error=12, Not enough space
	at java.lang.ProcessBuilder.start(ProcessBuilder.java:460)
	at java.lang.Runtime.exec(Runtime.java:593)
	at org.apache.tools.ant.taskdefs.Execute$Java13CommandLauncher.exec(Execute.java:862)
	at org.apache.tools.ant.taskdefs.Execute.launch(Execute.java:481)
	at org.apache.tools.ant.taskdefs.Execute.execute(Execute.java:495)
	at org.apache.tools.ant.taskdefs.Java.fork(Java.java:791)
	at org.apache.tools.ant.taskdefs.Java.executeJava(Java.java:214)
	at org.apache.tools.ant.taskdefs.Java.executeJava(Java.java:135)
	at org.apache.tools.ant.taskdefs.Java.execute(Java.java:108)
	at org.apache.tools.ant.UnknownElement.execute(UnknownElement.java:291)
	at sun.reflect.GeneratedMethodAccessor4.invoke(Unknown Source)
	at sun.reflect.DelegatingMethodAccessorImpl.invoke(DelegatingMethodAccessorImpl.java:25)
	at java.lang.reflect.Method.invoke(Method.java:597)
	at org.apache.tools.ant.dispatch.DispatchUtils.execute(DispatchUtils.java:106)
	at org.apache.tools.ant.Task.perform(Task.java:348)
	at org.apache.tools.ant.Target.execute(Target.java:390)
	at org.apache.tools.ant.Target.performTasks(Target.java:411)
	at org.apache.tools.ant.Project.executeSortedTargets(Project.java:1399)
	at org.apache.tools.ant.Project.executeTarget(Project.java:1368)
	at org.apache.tools.ant.helper.DefaultExecutor.executeTargets(DefaultExecutor.java:41)
	at org.apache.tools.ant.Project.executeTargets(Project.java:1251)
	at org.apache.tools.ant.Main.runBuild(Main.java:809)
	at org.apache.tools.ant.Main.startAnt(Main.java:217)
	at org.apache.tools.ant.launch.Launcher.run(Launcher.java:280)
	at org.apache.tools.ant.launch.Launcher.main(Launcher.java:109)
Caused by: java.io.IOException: error=12, Not enough space
	at java.lang.UNIXProcess.forkAndExec(Native Method)
	at java.lang.UNIXProcess.<init>(UNIXProcess.java:53)
	at java.lang.ProcessImpl.start(ProcessImpl.java:65)
	at java.lang.ProcessBuilder.start(ProcessBuilder.java:453)
	... 24 more

Total time: 1 minute 37 seconds
Build step 'Invoke Ant' marked build as failure
[locks-and-latches] Releasing all the locks
[locks-and-latches] All the locks released
Recording test results
ERROR: Step ?Publish JUnit test result report? failed: No test report files were found. Configuration
error?
Email was triggered for: Failure - Any
Sending email for trigger: Failure - Any



###################################################################################
############################## FAILED TESTS (if any) ##############################
No tests ran.
Mime
  • Unnamed multipart/mixed (inline, None, 0 bytes)
View raw message