zookeeper-dev mailing list archives

Site index · List index
Message view « Date » · « Thread »
Top « Date » · « Thread »
From Apache Jenkins Server <jenk...@builds.apache.org>
Subject ZooKeeper_branch35_solaris - Build # 343 - Still Failing
Date Wed, 07 Dec 2016 17:05:42 GMT
See https://builds.apache.org/job/ZooKeeper_branch35_solaris/343/

###################################################################################
########################## LAST 60 LINES OF THE CONSOLE ###########################
[...truncated 144517 lines...]
    [junit] 2016-12-07 17:06:27,465 [myid:] - INFO  [main:ClientBase@462] - Client test setup
finished
    [junit] 2016-12-07 17:06:27,465 [myid:] - INFO  [main:JUnit4ZKTestRunner$LoggedInvokeMethod@77]
- RUNNING TEST METHOD testMutipleWatcherObjs
    [junit] 2016-12-07 17:06:27,465 [myid:] - INFO  [main:ZooKeeper@853] - Initiating client
connection, connectString=127.0.0.1:11235 sessionTimeout=30000 watcher=org.apache.zookeeper.test.ClientBase$CountdownWatcher@48075
    [junit] 2016-12-07 17:06:27,466 [myid:127.0.0.1:11235] - INFO  [main-SendThread(127.0.0.1:11235):ClientCnxn$SendThread@1113]
- Opening socket connection to server 127.0.0.1/127.0.0.1:11235. Will not attempt to authenticate
using SASL (unknown error)
    [junit] 2016-12-07 17:06:27,466 [myid:127.0.0.1:11235] - INFO  [main-SendThread(127.0.0.1:11235):ClientCnxn$SendThread@948]
- Socket connection established, initiating session, client: null, server: null
    [junit] 2016-12-07 17:06:27,466 [myid:] - INFO  [NIOServerCxnFactory.AcceptThread:0.0.0.0/0.0.0.0:11235:NIOServerCnxnFactory$AcceptThread@296]
- Accepted socket connection from /127.0.0.1:46247
    [junit] 2016-12-07 17:06:27,467 [myid:] - INFO  [NIOWorkerThread-2:ZooKeeperServer@999]
- Client attempting to establish new session at /127.0.0.1:46247
    [junit] 2016-12-07 17:06:27,467 [myid:] - INFO  [SyncThread:0:FileTxnLog@204] - Creating
new log file: log.1
    [junit] 2016-12-07 17:06:27,473 [myid:] - INFO  [SyncThread:0:ZooKeeperServer@713] - Established
session 0x125573a30590000 with negotiated timeout 30000 for client /127.0.0.1:46247
    [junit] 2016-12-07 17:06:27,474 [myid:127.0.0.1:11235] - INFO  [main-SendThread(127.0.0.1:11235):ClientCnxn$SendThread@1381]
- Session establishment complete on server null, sessionid = 0x125573a30590000, negotiated
timeout = 30000
    [junit] 2016-12-07 17:06:27,475 [myid:] - INFO  [main:JMXEnv@117] - expect:0x125573a30590000
    [junit] 2016-12-07 17:06:27,475 [myid:] - INFO  [main:JMXEnv@120] - found:0x125573a30590000
org.apache.ZooKeeperService:name0=StandaloneServer_port11235,name1=Connections,name2=127.0.0.1,name3=0x125573a30590000
    [junit] 2016-12-07 17:06:28,261 [myid:] - INFO  [SessionTracker:SessionTrackerImpl@158]
- SessionTrackerImpl exited loop!
    [junit] 2016-12-07 17:06:28,261 [myid:] - INFO  [SessionTracker:SessionTrackerImpl@158]
- SessionTrackerImpl exited loop!
    [junit] 2016-12-07 17:06:28,261 [myid:] - INFO  [SessionTracker:SessionTrackerImpl@158]
- SessionTrackerImpl exited loop!
    [junit] 2016-12-07 17:06:28,261 [myid:] - INFO  [SessionTracker:SessionTrackerImpl@158]
- SessionTrackerImpl exited loop!
    [junit] 2016-12-07 17:06:29,214 [myid:] - INFO  [ProcessThread(sid:0 cport:11235)::PrepRequestProcessor@656]
- Processed session termination for sessionid: 0x125573a30590000
    [junit] 2016-12-07 17:06:29,215 [myid:] - INFO  [main:ZooKeeper@1311] - Session: 0x125573a30590000
closed
    [junit] 2016-12-07 17:06:29,215 [myid:] - INFO  [NIOWorkerThread-10:MBeanRegistry@128]
- Unregister MBean [org.apache.ZooKeeperService:name0=StandaloneServer_port11235,name1=Connections,name2=127.0.0.1,name3=0x125573a30590000]
    [junit] 2016-12-07 17:06:29,215 [myid:] - INFO  [main-EventThread:ClientCnxn$EventThread@513]
- EventThread shut down for session: 0x125573a30590000
    [junit] 2016-12-07 17:06:29,215 [myid:] - INFO  [main:JUnit4ZKTestRunner$LoggedInvokeMethod@82]
- Memory used 11781
    [junit] 2016-12-07 17:06:29,216 [myid:] - INFO  [NIOWorkerThread-10:NIOServerCnxn@607]
- Closed socket connection for client /127.0.0.1:46247 which had sessionid 0x125573a30590000
    [junit] 2016-12-07 17:06:29,216 [myid:] - INFO  [main:JUnit4ZKTestRunner$LoggedInvokeMethod@87]
- Number of threads 36
    [junit] 2016-12-07 17:06:29,216 [myid:] - INFO  [main:JUnit4ZKTestRunner$LoggedInvokeMethod@102]
- FINISHED TEST METHOD testMutipleWatcherObjs
    [junit] 2016-12-07 17:06:29,216 [myid:] - INFO  [main:ClientBase@543] - tearDown starting
    [junit] 2016-12-07 17:06:29,216 [myid:] - INFO  [main:ClientBase@513] - STOPPING server
    [junit] 2016-12-07 17:06:29,217 [myid:] - INFO  [ConnnectionExpirer:NIOServerCnxnFactory$ConnectionExpirerThread@583]
- ConnnectionExpirerThread interrupted
    [junit] 2016-12-07 17:06:29,217 [myid:] - INFO  [NIOServerCxnFactory.AcceptThread:0.0.0.0/0.0.0.0:11235:NIOServerCnxnFactory$AcceptThread@219]
- accept thread exitted run method
    [junit] 2016-12-07 17:06:29,217 [myid:] - INFO  [NIOServerCxnFactory.SelectorThread-0:NIOServerCnxnFactory$SelectorThread@420]
- selector thread exitted run method
    [junit] 2016-12-07 17:06:29,217 [myid:] - INFO  [NIOServerCxnFactory.SelectorThread-1:NIOServerCnxnFactory$SelectorThread@420]
- selector thread exitted run method
    [junit] 2016-12-07 17:06:29,219 [myid:] - INFO  [main:ZooKeeperServer@533] - shutting
down
    [junit] 2016-12-07 17:06:29,219 [myid:] - ERROR [main:ZooKeeperServer@505] - ZKShutdownHandler
is not registered, so ZooKeeper server won't take any action on ERROR or SHUTDOWN server state
changes
    [junit] 2016-12-07 17:06:29,219 [myid:] - INFO  [main:SessionTrackerImpl@232] - Shutting
down
    [junit] 2016-12-07 17:06:29,219 [myid:] - INFO  [main:PrepRequestProcessor@974] - Shutting
down
    [junit] 2016-12-07 17:06:29,219 [myid:] - INFO  [main:SyncRequestProcessor@191] - Shutting
down
    [junit] 2016-12-07 17:06:29,219 [myid:] - INFO  [ProcessThread(sid:0 cport:11235)::PrepRequestProcessor@154]
- PrepRequestProcessor exited loop!
    [junit] 2016-12-07 17:06:29,219 [myid:] - INFO  [SyncThread:0:SyncRequestProcessor@169]
- SyncRequestProcessor exited!
    [junit] 2016-12-07 17:06:29,219 [myid:] - INFO  [main:FinalRequestProcessor@479] - shutdown
of request processor complete
    [junit] 2016-12-07 17:06:29,220 [myid:] - INFO  [main:MBeanRegistry@128] - Unregister
MBean [org.apache.ZooKeeperService:name0=StandaloneServer_port11235,name1=InMemoryDataTree]
    [junit] 2016-12-07 17:06:29,220 [myid:] - INFO  [main:MBeanRegistry@128] - Unregister
MBean [org.apache.ZooKeeperService:name0=StandaloneServer_port11235]
    [junit] 2016-12-07 17:06:29,220 [myid:] - INFO  [main:FourLetterWordMain@85] - connecting
to 127.0.0.1 11235
    [junit] 2016-12-07 17:06:29,221 [myid:] - INFO  [main:JMXEnv@146] - ensureOnly:[]
    [junit] 2016-12-07 17:06:29,251 [myid:] - INFO  [main:ClientBase@568] - fdcount after
test is: 60 at start it was 60
    [junit] 2016-12-07 17:06:29,251 [myid:] - INFO  [main:ZKTestCase$1@65] - SUCCEEDED testMutipleWatcherObjs
    [junit] 2016-12-07 17:06:29,251 [myid:] - INFO  [main:ZKTestCase$1@60] - FINISHED testMutipleWatcherObjs
    [junit] Tests run: 14, Failures: 0, Errors: 0, Time elapsed: 74.457 sec
    [junit] Running org.apache.zookeeper.test.CnxManagerTest
    [junit] Tests run: 1, Failures: 0, Errors: 1, Time elapsed: 0 sec

BUILD FAILED
/zonestorage/hudson_solaris/home/hudson/hudson-slave/workspace/ZooKeeper_branch35_solaris/build.xml:1220:
Process fork failed.

Total time: 57 minutes 31 seconds
Build step 'Invoke Ant' marked build as failure
[locks-and-latches] Releasing all the locks
[locks-and-latches] All the locks released
Recording test results
Email was triggered for: Failure - Any
Sending email for trigger: Failure - Any



###################################################################################
############################## FAILED TESTS (if any) ##############################
2 tests failed.
FAILED:  org.apache.zookeeper.server.quorum.RaceConditionTest.testRaceConditionBetweenLeaderAndAckRequestProcessor

Error Message:
test timed out after 30000 milliseconds

Stack Trace:
	at java.lang.Thread.sleep(Native Method)
	at org.apache.zookeeper.test.ClientBase.waitForServerState(ClientBase.java:301)
	at org.apache.zookeeper.server.quorum.RaceConditionTest.testRaceConditionBetweenLeaderAndAckRequestProcessor(RaceConditionTest.java:74)
	at org.apache.zookeeper.JUnit4ZKTestRunner$LoggedInvokeMethod.evaluate(JUnit4ZKTestRunner.java:79)
	at java.util.concurrent.FutureTask.run(FutureTask.java:262)
	at java.lang.Thread.run(Thread.java:745)


FAILED:  org.apache.zookeeper.test.CnxManagerTest.unknown

Error Message:
Forked Java VM exited abnormally. Please note the time in the report does not reflect the
time until the VM exit.

Stack Trace:
junit.framework.AssertionFailedError: Forked Java VM exited abnormally. Please note the time
in the report does not reflect the time until the VM exit.



Mime
  • Unnamed multipart/mixed (inline, None, 0 bytes)
View raw message