zookeeper-dev mailing list archives

Site index · List index
Message view « Date » · « Thread »
Top « Date » · « Thread »
From Apache Jenkins Server <jenk...@builds.apache.org>
Subject ZooKeeper-trunk-solaris - Build # 1414 - Still Failing
Date Thu, 08 Dec 2016 07:15:24 GMT
See https://builds.apache.org/job/ZooKeeper-trunk-solaris/1414/

###################################################################################
########################## LAST 60 LINES OF THE CONSOLE ###########################
[...truncated 76 lines...]
ivy-taskdef:

ivy-init:

ivy-retrieve:
[ivy:retrieve] :: Apache Ivy 2.4.0 - 20141213170938 :: http://ant.apache.org/ivy/ ::
[ivy:retrieve] :: loading settings :: file = /zonestorage/hudson_solaris/home/hudson/hudson-slave/workspace/ZooKeeper-trunk-solaris/ivysettings.xml
[ivy:retrieve] :: resolving dependencies :: org.apache.zookeeper#zookeeper;3.6.0-SNAPSHOT
[ivy:retrieve] 	confs: [default]
[ivy:retrieve] 	found jline#jline;2.11 in maven2
[ivy:retrieve] 	found org.eclipse.jetty#jetty-server;9.2.18.v20160721 in maven2
[ivy:retrieve] 	found javax.servlet#javax.servlet-api;3.1.0 in maven2
[ivy:retrieve] 	found org.eclipse.jetty#jetty-http;9.2.18.v20160721 in maven2
[ivy:retrieve] 	found org.eclipse.jetty#jetty-util;9.2.18.v20160721 in maven2
[ivy:retrieve] 	found org.eclipse.jetty#jetty-io;9.2.18.v20160721 in maven2
[ivy:retrieve] 	found org.eclipse.jetty#jetty-servlet;9.2.18.v20160721 in maven2
[ivy:retrieve] 	found org.eclipse.jetty#jetty-security;9.2.18.v20160721 in maven2
[ivy:retrieve] 	found org.codehaus.jackson#jackson-mapper-asl;1.9.11 in maven2
[ivy:retrieve] 	found org.codehaus.jackson#jackson-core-asl;1.9.11 in maven2
[ivy:retrieve] 	found org.slf4j#slf4j-api;1.7.5 in maven2
[ivy:retrieve] 	found org.slf4j#slf4j-log4j12;1.7.5 in maven2
[ivy:retrieve] 	found commons-cli#commons-cli;1.2 in maven2
[ivy:retrieve] 	found log4j#log4j;1.2.17 in maven2
[ivy:retrieve] 	found io.netty#netty;3.10.5.Final in maven2
[ivy:retrieve] 	found net.java.dev.javacc#javacc;5.0 in maven2
[ivy:retrieve] :: resolution report :: resolve 1193ms :: artifacts dl 16ms
	---------------------------------------------------------------------
	|                  |            modules            ||   artifacts   |
	|       conf       | number| search|dwnlded|evicted|| number|dwnlded|
	---------------------------------------------------------------------
	|      default     |   16  |   0   |   0   |   0   ||   16  |   0   |
	---------------------------------------------------------------------
[ivy:retrieve] :: retrieving :: org.apache.zookeeper#zookeeper
[ivy:retrieve] 	confs: [default]
[ivy:retrieve] 	16 artifacts copied, 0 already retrieved (4635kB/977ms)

clover.setup:

clover.info:

clover:

generate_jute_parser:
    [mkdir] Created dir: /zonestorage/hudson_solaris/home/hudson/hudson-slave/workspace/ZooKeeper-trunk-solaris/build/jute_compiler/org/apache/jute/compiler/generated
[ivy:artifactproperty] DEPRECATED: 'ivy.conf.file' is deprecated, use 'ivy.settings.file'
instead
[ivy:artifactproperty] :: loading settings :: file = /zonestorage/hudson_solaris/home/hudson/hudson-slave/workspace/ZooKeeper-trunk-solaris/ivysettings.xml
     [move] Moving 1 file to /zonestorage/hudson_solaris/home/hudson/hudson-slave/workspace/ZooKeeper-trunk-solaris/build/lib

BUILD FAILED
/zonestorage/hudson_solaris/home/hudson/hudson-slave/workspace/ZooKeeper-trunk-solaris/build.xml:267:
Could not launch /zonestorage/hudson_solaris/home/hudson/tools/java/jdk1.7.0_79/jre/bin/java:
java.io.IOException: Cannot run program "/zonestorage/hudson_solaris/home/hudson/tools/java/jdk1.7.0_79/jre/bin/java":
error=12, Not enough space

Total time: 29 seconds
Build step 'Invoke Ant' marked build as failure
[locks-and-latches] Releasing all the locks
[locks-and-latches] All the locks released
Recording test results
ERROR: Step ?Publish JUnit test result report? failed: No test report files were found. Configuration
error?
Email was triggered for: Failure - Any
Sending email for trigger: Failure - Any



###################################################################################
############################## FAILED TESTS (if any) ##############################
No tests ran.
Mime
  • Unnamed multipart/mixed (inline, None, 0 bytes)
View raw message