zookeeper-dev mailing list archives

Site index · List index
Message view « Date » · « Thread »
Top « Date » · « Thread »
From Apache Jenkins Server <jenk...@builds.apache.org>
Subject ZooKeeper-trunk - Build # 3155 - Failure
Date Sun, 13 Nov 2016 20:31:30 GMT
See https://builds.apache.org/job/ZooKeeper-trunk/3155/

###################################################################################
########################## LAST 60 LINES OF THE CONSOLE ###########################
[...truncated 431481 lines...]
    [junit] 	at org.jboss.netty.util.internal.DeadLockProofWorker$1.run(DeadLockProofWorker.java:42)
    [junit] 	at java.util.concurrent.ThreadPoolExecutor.runWorker(ThreadPoolExecutor.java:1145)
    [junit] 	at java.util.concurrent.ThreadPoolExecutor$Worker.run(ThreadPoolExecutor.java:615)
    [junit] 	at java.lang.Thread.run(Thread.java:745)
    [junit] 2016-11-13 20:29:46,243 [myid:] - INFO  [SyncThread:0:MBeanRegistry@128] - Unregister
MBean [org.apache.ZooKeeperService:name0=StandaloneServer_port19545,name1=Connections,name2=127.0.0.1,name3=0x100f31db3470000]
    [junit] 2016-11-13 20:29:46,343 [myid:] - INFO  [main:ZooKeeper@1313] - Session: 0x100f31db3470000
closed
    [junit] 2016-11-13 20:29:46,343 [myid:] - INFO  [main-EventThread:ClientCnxn$EventThread@513]
- EventThread shut down for session: 0x100f31db3470000
    [junit] 2016-11-13 20:29:46,343 [myid:] - INFO  [main:JUnit4ZKTestRunner$LoggedInvokeMethod@82]
- Memory used 167973
    [junit] 2016-11-13 20:29:46,344 [myid:] - INFO  [main:JUnit4ZKTestRunner$LoggedInvokeMethod@87]
- Number of threads 1643
    [junit] 2016-11-13 20:29:46,344 [myid:] - INFO  [main:JUnit4ZKTestRunner$LoggedInvokeMethod@102]
- FINISHED TEST METHOD testWatcherAutoResetWithLocal
    [junit] 2016-11-13 20:29:46,344 [myid:] - INFO  [main:ClientBase@543] - tearDown starting
    [junit] 2016-11-13 20:29:46,344 [myid:] - INFO  [main:ClientBase@513] - STOPPING server
    [junit] 2016-11-13 20:29:46,344 [myid:] - INFO  [main:NettyServerCnxnFactory@464] - shutdown
called 0.0.0.0/0.0.0.0:19545
    [junit] 2016-11-13 20:29:46,349 [myid:] - INFO  [main:ZooKeeperServer@530] - shutting
down
    [junit] 2016-11-13 20:29:46,349 [myid:] - ERROR [main:ZooKeeperServer@502] - ZKShutdownHandler
is not registered, so ZooKeeper server won't take any action on ERROR or SHUTDOWN server state
changes
    [junit] 2016-11-13 20:29:46,349 [myid:] - INFO  [main:SessionTrackerImpl@232] - Shutting
down
    [junit] 2016-11-13 20:29:46,349 [myid:] - INFO  [main:PrepRequestProcessor@1005] - Shutting
down
    [junit] 2016-11-13 20:29:46,350 [myid:] - INFO  [main:SyncRequestProcessor@191] - Shutting
down
    [junit] 2016-11-13 20:29:46,350 [myid:] - INFO  [ProcessThread(sid:0 cport:19545)::PrepRequestProcessor@156]
- PrepRequestProcessor exited loop!
    [junit] 2016-11-13 20:29:46,350 [myid:] - INFO  [SyncThread:0:SyncRequestProcessor@169]
- SyncRequestProcessor exited!
    [junit] 2016-11-13 20:29:46,350 [myid:] - INFO  [main:FinalRequestProcessor@481] - shutdown
of request processor complete
    [junit] 2016-11-13 20:29:46,350 [myid:] - INFO  [main:MBeanRegistry@128] - Unregister
MBean [org.apache.ZooKeeperService:name0=StandaloneServer_port19545,name1=InMemoryDataTree]
    [junit] 2016-11-13 20:29:46,351 [myid:] - INFO  [main:MBeanRegistry@128] - Unregister
MBean [org.apache.ZooKeeperService:name0=StandaloneServer_port19545]
    [junit] 2016-11-13 20:29:46,351 [myid:] - INFO  [main:FourLetterWordMain@85] - connecting
to 127.0.0.1 19545
    [junit] 2016-11-13 20:29:46,351 [myid:] - INFO  [main:JMXEnv@146] - ensureOnly:[]
    [junit] 2016-11-13 20:29:46,357 [myid:] - INFO  [main:ClientBase@568] - fdcount after
test is: 4820 at start it was 4820
    [junit] 2016-11-13 20:29:46,357 [myid:] - INFO  [main:ZKTestCase$1@65] - SUCCEEDED testWatcherAutoResetWithLocal
    [junit] 2016-11-13 20:29:46,357 [myid:] - INFO  [main:ZKTestCase$1@60] - FINISHED testWatcherAutoResetWithLocal
    [junit] Tests run: 101, Failures: 0, Errors: 0, Skipped: 0, Time elapsed: 524.655 sec,
Thread: 4, Class: org.apache.zookeeper.test.NioNettySuiteTest
    [junit] 2016-11-13 20:29:46,563 [myid:127.0.0.1:19428] - INFO  [main-SendThread(127.0.0.1:19428):ClientCnxn$SendThread@1113]
- Opening socket connection to server 127.0.0.1/127.0.0.1:19428. Will not attempt to authenticate
using SASL (unknown error)
    [junit] 2016-11-13 20:29:46,563 [myid:127.0.0.1:19428] - WARN  [main-SendThread(127.0.0.1:19428):ClientCnxn$SendThread@1235]
- Session 0x300f31a74810000 for server 127.0.0.1/127.0.0.1:19428, unexpected error, closing
socket connection and attempting reconnect
    [junit] java.net.ConnectException: Connection refused
    [junit] 	at sun.nio.ch.SocketChannelImpl.checkConnect(Native Method)
    [junit] 	at sun.nio.ch.SocketChannelImpl.finishConnect(SocketChannelImpl.java:744)
    [junit] 	at org.apache.zookeeper.ClientCnxnSocketNIO.doTransport(ClientCnxnSocketNIO.java:357)
    [junit] 	at org.apache.zookeeper.ClientCnxn$SendThread.run(ClientCnxn.java:1214)

BUILD FAILED
/home/jenkins/jenkins-slave/workspace/ZooKeeper-trunk/build.xml:1324: The following error
occurred while executing this line:
/home/jenkins/jenkins-slave/workspace/ZooKeeper-trunk/build.xml:1209: Tests failed!

Total time: 13 minutes 2 seconds
Build step 'Execute shell' marked build as failure
[FINDBUGS] Skipping publisher since build result is FAILURE
[WARNINGS] Skipping publisher since build result is FAILURE
Archiving artifacts
Setting JDK_1_7_LATEST__HOME=/home/jenkins/tools/java/latest1.7
Recording fingerprints
Setting JDK_1_7_LATEST__HOME=/home/jenkins/tools/java/latest1.7
Updating ZOOKEEPER-2014
Recording test results
Setting JDK_1_7_LATEST__HOME=/home/jenkins/tools/java/latest1.7
Publishing Javadoc
Setting JDK_1_7_LATEST__HOME=/home/jenkins/tools/java/latest1.7
Setting JDK_1_7_LATEST__HOME=/home/jenkins/tools/java/latest1.7
Email was triggered for: Failure - Any
Sending email for trigger: Failure - Any
Setting JDK_1_7_LATEST__HOME=/home/jenkins/tools/java/latest1.7
Setting JDK_1_7_LATEST__HOME=/home/jenkins/tools/java/latest1.7



###################################################################################
############################## FAILED TESTS (if any) ##############################
3 tests failed.
FAILED:  org.apache.zookeeper.test.LETest.testLE

Error Message:
Threads didn't join

Stack Trace:
junit.framework.AssertionFailedError: Threads didn't join
	at org.apache.zookeeper.test.LETest.testLE(LETest.java:123)
	at org.apache.zookeeper.JUnit4ZKTestRunner$LoggedInvokeMethod.evaluate(JUnit4ZKTestRunner.java:79)


FAILED:  org.apache.zookeeper.test.QuorumTest.testNoLogBeforeLeaderEstablishment

Error Message:
Not following

Stack Trace:
junit.framework.AssertionFailedError: Not following
	at org.apache.zookeeper.test.QuorumTest.testNoLogBeforeLeaderEstablishment(QuorumTest.java:411)
	at org.apache.zookeeper.JUnit4ZKTestRunner$LoggedInvokeMethod.evaluate(JUnit4ZKTestRunner.java:79)


FAILED:  org.apache.zookeeper.test.ReadOnlyModeTest.testMultiTransaction

Error Message:
Failed to connect to ZooKeeper server.

Stack Trace:
java.util.concurrent.TimeoutException: Failed to connect to ZooKeeper server.
	at org.apache.zookeeper.test.ClientBase$CountdownWatcher.waitForConnected(ClientBase.java:132)
	at org.apache.zookeeper.test.ReadOnlyModeTest.testMultiTransaction(ReadOnlyModeTest.java:85)
	at org.apache.zookeeper.JUnit4ZKTestRunner$LoggedInvokeMethod.evaluate(JUnit4ZKTestRunner.java:79)
	at java.util.concurrent.FutureTask.run(FutureTask.java:262)
	at java.lang.Thread.run(Thread.java:745)



Mime
  • Unnamed multipart/mixed (inline, None, 0 bytes)
View raw message