zookeeper-dev mailing list archives

Site index · List index
Message view « Date » · « Thread »
Top « Date » · « Thread »
From Apache Jenkins Server <jenk...@builds.apache.org>
Subject ZooKeeper-trunk - Build # 3176 - Failure
Date Tue, 29 Nov 2016 23:34:39 GMT
See https://builds.apache.org/job/ZooKeeper-trunk/3176/

###################################################################################
########################## LAST 60 LINES OF THE CONSOLE ###########################
[...truncated 491792 lines...]
    [junit] 2016-11-29 23:33:38,113 [myid:127.0.0.1:19340] - INFO  [main-SendThread(127.0.0.1:19340):ClientCnxn$SendThread@1113]
- Opening socket connection to server 127.0.0.1/127.0.0.1:19340. Will not attempt to authenticate
using SASL (unknown error)
    [junit] 2016-11-29 23:33:38,114 [myid:127.0.0.1:19340] - WARN  [main-SendThread(127.0.0.1:19340):ClientCnxn$SendThread@1235]
- Session 0x20142d47a010000 for server 127.0.0.1/127.0.0.1:19340, unexpected error, closing
socket connection and attempting reconnect
    [junit] java.net.ConnectException: Connection refused
    [junit] 	at sun.nio.ch.SocketChannelImpl.checkConnect(Native Method)
    [junit] 	at sun.nio.ch.SocketChannelImpl.finishConnect(SocketChannelImpl.java:744)
    [junit] 	at org.apache.zookeeper.ClientCnxnSocketNIO.doTransport(ClientCnxnSocketNIO.java:357)
    [junit] 	at org.apache.zookeeper.ClientCnxn$SendThread.run(ClientCnxn.java:1214)
    [junit] 2016-11-29 23:33:38,663 [myid:127.0.0.1:19337] - INFO  [main-SendThread(127.0.0.1:19337):ClientCnxn$SendThread@1113]
- Opening socket connection to server 127.0.0.1/127.0.0.1:19337. Will not attempt to authenticate
using SASL (unknown error)
    [junit] 2016-11-29 23:33:38,664 [myid:127.0.0.1:19337] - WARN  [main-SendThread(127.0.0.1:19337):ClientCnxn$SendThread@1235]
- Session 0x10142d476910000 for server 127.0.0.1/127.0.0.1:19337, unexpected error, closing
socket connection and attempting reconnect
    [junit] java.net.ConnectException: Connection refused
    [junit] 	at sun.nio.ch.SocketChannelImpl.checkConnect(Native Method)
    [junit] 	at sun.nio.ch.SocketChannelImpl.finishConnect(SocketChannelImpl.java:744)
    [junit] 	at org.apache.zookeeper.ClientCnxnSocketNIO.doTransport(ClientCnxnSocketNIO.java:357)
    [junit] 	at org.apache.zookeeper.ClientCnxn$SendThread.run(ClientCnxn.java:1214)
    [junit] 2016-11-29 23:33:38,957 [myid:127.0.0.1:19343] - INFO  [main-SendThread(127.0.0.1:19343):ClientCnxn$SendThread@1113]
- Opening socket connection to server 127.0.0.1/127.0.0.1:19343. Will not attempt to authenticate
using SASL (unknown error)
    [junit] 2016-11-29 23:33:38,957 [myid:127.0.0.1:19343] - INFO  [main-SendThread(127.0.0.1:19343):ClientCnxn$SendThread@948]
- Socket connection established, initiating session, client: /127.0.0.1:55790, server: 127.0.0.1/127.0.0.1:19343
    [junit] 2016-11-29 23:33:38,957 [myid:] - INFO  [NIOServerCxnFactory.AcceptThread:/127.0.0.1:19343:NIOServerCnxnFactory$AcceptThread@296]
- Accepted socket connection from /127.0.0.1:55790
    [junit] 2016-11-29 23:33:38,958 [myid:] - WARN  [NIOWorkerThread-13:NIOServerCnxn@369]
- Exception causing close of session 0x0: ZooKeeperServer not running
    [junit] 2016-11-29 23:33:38,958 [myid:] - INFO  [NIOWorkerThread-13:NIOServerCnxn@607]
- Closed socket connection for client /127.0.0.1:55790 (no session established for client)
    [junit] 2016-11-29 23:33:38,958 [myid:127.0.0.1:19343] - INFO  [main-SendThread(127.0.0.1:19343):ClientCnxn$SendThread@1231]
- Unable to read additional data from server sessionid 0x30142d477620000, likely server has
closed socket, closing socket connection and attempting reconnect
    [junit] 2016-11-29 23:33:39,298 [myid:127.0.0.1:19340] - INFO  [main-SendThread(127.0.0.1:19340):ClientCnxn$SendThread@1113]
- Opening socket connection to server 127.0.0.1/127.0.0.1:19340. Will not attempt to authenticate
using SASL (unknown error)
    [junit] 2016-11-29 23:33:39,298 [myid:127.0.0.1:19340] - WARN  [main-SendThread(127.0.0.1:19340):ClientCnxn$SendThread@1235]
- Session 0x20142d47a010000 for server 127.0.0.1/127.0.0.1:19340, unexpected error, closing
socket connection and attempting reconnect
    [junit] java.net.ConnectException: Connection refused
    [junit] 	at sun.nio.ch.SocketChannelImpl.checkConnect(Native Method)
    [junit] 	at sun.nio.ch.SocketChannelImpl.finishConnect(SocketChannelImpl.java:744)
    [junit] 	at org.apache.zookeeper.ClientCnxnSocketNIO.doTransport(ClientCnxnSocketNIO.java:357)
    [junit] 	at org.apache.zookeeper.ClientCnxn$SendThread.run(ClientCnxn.java:1214)
    [junit] 2016-11-29 23:33:40,035 [myid:127.0.0.1:19337] - INFO  [main-SendThread(127.0.0.1:19337):ClientCnxn$SendThread@1113]
- Opening socket connection to server 127.0.0.1/127.0.0.1:19337. Will not attempt to authenticate
using SASL (unknown error)
    [junit] 2016-11-29 23:33:40,036 [myid:127.0.0.1:19337] - WARN  [main-SendThread(127.0.0.1:19337):ClientCnxn$SendThread@1235]
- Session 0x10142d476910000 for server 127.0.0.1/127.0.0.1:19337, unexpected error, closing
socket connection and attempting reconnect
    [junit] java.net.ConnectException: Connection refused
    [junit] 	at sun.nio.ch.SocketChannelImpl.checkConnect(Native Method)
    [junit] 	at sun.nio.ch.SocketChannelImpl.finishConnect(SocketChannelImpl.java:744)
    [junit] 	at org.apache.zookeeper.ClientCnxnSocketNIO.doTransport(ClientCnxnSocketNIO.java:357)
    [junit] 	at org.apache.zookeeper.ClientCnxn$SendThread.run(ClientCnxn.java:1214)
    [junit] Running org.apache.zookeeper.server.ZxidRolloverTest in thread 4
    [junit] Tests run: 1, Failures: 0, Errors: 1, Skipped: 0, Time elapsed: 0 sec, Thread:
4, Class: org.apache.zookeeper.server.ZxidRolloverTest
    [junit] Test org.apache.zookeeper.server.ZxidRolloverTest FAILED (timeout)

BUILD FAILED
/home/jenkins/jenkins-slave/workspace/ZooKeeper-trunk/build.xml:1324: The following error
occurred while executing this line:
/home/jenkins/jenkins-slave/workspace/ZooKeeper-trunk/build.xml:1209: Tests failed!

Total time: 15 minutes 37 seconds
Build step 'Execute shell' marked build as failure
[FINDBUGS] Skipping publisher since build result is FAILURE
[WARNINGS] Skipping publisher since build result is FAILURE
Archiving artifacts
Setting JDK_1_7_LATEST__HOME=/home/jenkins/tools/java/latest1.7
Recording fingerprints
Setting JDK_1_7_LATEST__HOME=/home/jenkins/tools/java/latest1.7
Recording test results
Setting JDK_1_7_LATEST__HOME=/home/jenkins/tools/java/latest1.7
Publishing Javadoc
Setting JDK_1_7_LATEST__HOME=/home/jenkins/tools/java/latest1.7
Setting JDK_1_7_LATEST__HOME=/home/jenkins/tools/java/latest1.7
Email was triggered for: Failure - Any
Sending email for trigger: Failure - Any
Setting JDK_1_7_LATEST__HOME=/home/jenkins/tools/java/latest1.7
Setting JDK_1_7_LATEST__HOME=/home/jenkins/tools/java/latest1.7



###################################################################################
############################## FAILED TESTS (if any) ##############################
1 tests failed.
FAILED:  org.apache.zookeeper.server.ZxidRolloverTest.testRolloverThenRestart

Error Message:
Timeout occurred. Please note the time in the report does not reflect the time until the timeout.

Stack Trace:
junit.framework.AssertionFailedError: Timeout occurred. Please note the time in the report
does not reflect the time until the timeout.
	at java.lang.Thread.run(Thread.java:745)



Mime
  • Unnamed multipart/mixed (inline, None, 0 bytes)
View raw message