zookeeper-dev mailing list archives

Site index · List index
Message view « Date » · « Thread »
Top « Date » · « Thread »
From Apache Jenkins Server <jenk...@builds.apache.org>
Subject ZooKeeper-trunk - Build # 3167 - Still Failing
Date Tue, 22 Nov 2016 23:42:08 GMT
See https://builds.apache.org/job/ZooKeeper-trunk/3167/

###################################################################################
########################## LAST 60 LINES OF THE CONSOLE ###########################
[...truncated 476015 lines...]
    [junit] 	at sun.nio.ch.SocketChannelImpl.finishConnect(SocketChannelImpl.java:744)
    [junit] 	at org.apache.zookeeper.ClientCnxnSocketNIO.doTransport(ClientCnxnSocketNIO.java:357)
    [junit] 	at org.apache.zookeeper.ClientCnxn$SendThread.run(ClientCnxn.java:1214)
    [junit] 2016-11-22 23:29:34,955 [myid:] - INFO  [main:ZooKeeper@1313] - Session: 0x1011ed0c6230000
closed
    [junit] 2016-11-22 23:29:34,955 [myid:] - INFO  [main-EventThread:ClientCnxn$EventThread@513]
- EventThread shut down for session: 0x1011ed0c6230000
    [junit] 2016-11-22 23:29:34,956 [myid:] - INFO  [main:JUnit4ZKTestRunner$LoggedInvokeMethod@82]
- Memory used 155537
    [junit] 2016-11-22 23:29:34,956 [myid:] - INFO  [main:JUnit4ZKTestRunner$LoggedInvokeMethod@87]
- Number of threads 1642
    [junit] 2016-11-22 23:29:34,956 [myid:] - INFO  [main:JUnit4ZKTestRunner$LoggedInvokeMethod@102]
- FINISHED TEST METHOD testWatcherAutoResetWithLocal
    [junit] 2016-11-22 23:29:34,956 [myid:] - INFO  [main:ClientBase@543] - tearDown starting
    [junit] 2016-11-22 23:29:34,956 [myid:] - INFO  [main:ClientBase@513] - STOPPING server
    [junit] 2016-11-22 23:29:34,956 [myid:] - INFO  [main:NettyServerCnxnFactory@464] - shutdown
called 0.0.0.0/0.0.0.0:11466
    [junit] 2016-11-22 23:29:34,961 [myid:] - INFO  [main:ZooKeeperServer@531] - shutting
down
    [junit] 2016-11-22 23:29:34,962 [myid:] - ERROR [main:ZooKeeperServer@503] - ZKShutdownHandler
is not registered, so ZooKeeper server won't take any action on ERROR or SHUTDOWN server state
changes
    [junit] 2016-11-22 23:29:34,962 [myid:] - INFO  [main:SessionTrackerImpl@232] - Shutting
down
    [junit] 2016-11-22 23:29:34,962 [myid:] - INFO  [main:PrepRequestProcessor@1009] - Shutting
down
    [junit] 2016-11-22 23:29:34,962 [myid:] - INFO  [main:SyncRequestProcessor@191] - Shutting
down
    [junit] 2016-11-22 23:29:34,962 [myid:] - INFO  [ProcessThread(sid:0 cport:11466)::PrepRequestProcessor@157]
- PrepRequestProcessor exited loop!
    [junit] 2016-11-22 23:29:34,963 [myid:] - INFO  [SyncThread:0:SyncRequestProcessor@169]
- SyncRequestProcessor exited!
    [junit] 2016-11-22 23:29:34,963 [myid:] - INFO  [main:FinalRequestProcessor@481] - shutdown
of request processor complete
    [junit] 2016-11-22 23:29:34,963 [myid:] - INFO  [main:MBeanRegistry@128] - Unregister
MBean [org.apache.ZooKeeperService:name0=StandaloneServer_port11466,name1=InMemoryDataTree]
    [junit] 2016-11-22 23:29:34,963 [myid:] - INFO  [main:MBeanRegistry@128] - Unregister
MBean [org.apache.ZooKeeperService:name0=StandaloneServer_port11466]
    [junit] 2016-11-22 23:29:34,964 [myid:] - INFO  [main:FourLetterWordMain@85] - connecting
to 127.0.0.1 11466
    [junit] 2016-11-22 23:29:34,964 [myid:] - INFO  [main:JMXEnv@146] - ensureOnly:[]
    [junit] 2016-11-22 23:29:34,968 [myid:127.0.0.1:11346] - INFO  [main-SendThread(127.0.0.1:11346):ClientCnxn$SendThread@1113]
- Opening socket connection to server 127.0.0.1/127.0.0.1:11346. Will not attempt to authenticate
using SASL (unknown error)
    [junit] 2016-11-22 23:29:34,968 [myid:127.0.0.1:11346] - WARN  [main-SendThread(127.0.0.1:11346):ClientCnxn$SendThread@1235]
- Session 0x2011ecdc84c0000 for server 127.0.0.1/127.0.0.1:11346, unexpected error, closing
socket connection and attempting reconnect
    [junit] java.net.ConnectException: Connection refused
    [junit] 	at sun.nio.ch.SocketChannelImpl.checkConnect(Native Method)
    [junit] 	at sun.nio.ch.SocketChannelImpl.finishConnect(SocketChannelImpl.java:744)
    [junit] 	at org.apache.zookeeper.ClientCnxnSocketNIO.doTransport(ClientCnxnSocketNIO.java:357)
    [junit] 	at org.apache.zookeeper.ClientCnxn$SendThread.run(ClientCnxn.java:1214)
    [junit] 2016-11-22 23:29:34,970 [myid:] - INFO  [main:ClientBase@568] - fdcount after
test is: 4825 at start it was 4825
    [junit] 2016-11-22 23:29:34,970 [myid:] - INFO  [main:ZKTestCase$1@65] - SUCCEEDED testWatcherAutoResetWithLocal
    [junit] 2016-11-22 23:29:34,970 [myid:] - INFO  [main:ZKTestCase$1@60] - FINISHED testWatcherAutoResetWithLocal
    [junit] Tests run: 101, Failures: 0, Errors: 0, Skipped: 0, Time elapsed: 519.515 sec,
Thread: 1, Class: org.apache.zookeeper.test.NioNettySuiteTest
    [junit] Running org.apache.zookeeper.test.ZkDatabaseCorruptionTest in thread 8
    [junit] Tests run: 1, Failures: 0, Errors: 1, Skipped: 0, Time elapsed: 0 sec, Thread:
8, Class: org.apache.zookeeper.test.ZkDatabaseCorruptionTest
    [junit] Test org.apache.zookeeper.test.ZkDatabaseCorruptionTest FAILED (timeout)

BUILD FAILED
/home/jenkins/jenkins-slave/workspace/ZooKeeper-trunk/build.xml:1324: The following error
occurred while executing this line:
/home/jenkins/jenkins-slave/workspace/ZooKeeper-trunk/build.xml:1209: Tests failed!

Total time: 23 minutes 41 seconds
Build step 'Execute shell' marked build as failure
[FINDBUGS] Skipping publisher since build result is FAILURE
[WARNINGS] Skipping publisher since build result is FAILURE
Archiving artifacts
Setting JDK_1_7_LATEST__HOME=/home/jenkins/tools/java/latest1.7
Recording fingerprints
Setting JDK_1_7_LATEST__HOME=/home/jenkins/tools/java/latest1.7
Recording test results
Setting JDK_1_7_LATEST__HOME=/home/jenkins/tools/java/latest1.7
Publishing Javadoc
Setting JDK_1_7_LATEST__HOME=/home/jenkins/tools/java/latest1.7
Setting JDK_1_7_LATEST__HOME=/home/jenkins/tools/java/latest1.7
Email was triggered for: Failure - Any
Sending email for trigger: Failure - Any
Setting JDK_1_7_LATEST__HOME=/home/jenkins/tools/java/latest1.7
Setting JDK_1_7_LATEST__HOME=/home/jenkins/tools/java/latest1.7



###################################################################################
############################## FAILED TESTS (if any) ##############################
1 tests failed.
FAILED:  org.apache.zookeeper.test.ZkDatabaseCorruptionTest.testCorruption

Error Message:
Timeout occurred. Please note the time in the report does not reflect the time until the timeout.

Stack Trace:
junit.framework.AssertionFailedError: Timeout occurred. Please note the time in the report
does not reflect the time until the timeout.
	at java.lang.Thread.run(Thread.java:745)



Mime
  • Unnamed multipart/mixed (inline, None, 0 bytes)
View raw message