zookeeper-dev mailing list archives

Site index · List index
Message view « Date » · « Thread »
Top « Date » · « Thread »
From Apache Jenkins Server <jenk...@builds.apache.org>
Subject ZooKeeper-trunk - Build # 3157 - Still Failing
Date Mon, 14 Nov 2016 23:35:53 GMT
See https://builds.apache.org/job/ZooKeeper-trunk/3157/

###################################################################################
########################## LAST 60 LINES OF THE CONSOLE ###########################
[...truncated 426388 lines...]
    [junit] java.net.ConnectException: Connection refused
    [junit] 	at java.net.PlainSocketImpl.socketConnect(Native Method)
    [junit] 	at java.net.AbstractPlainSocketImpl.doConnect(AbstractPlainSocketImpl.java:339)
    [junit] 	at java.net.AbstractPlainSocketImpl.connectToAddress(AbstractPlainSocketImpl.java:200)
    [junit] 	at java.net.AbstractPlainSocketImpl.connect(AbstractPlainSocketImpl.java:182)
    [junit] 	at java.net.SocksSocketImpl.connect(SocksSocketImpl.java:392)
    [junit] 	at java.net.Socket.connect(Socket.java:579)
    [junit] 	at org.apache.zookeeper.server.quorum.QuorumCnxManager.connectOne(QuorumCnxManager.java:441)
    [junit] 	at org.apache.zookeeper.server.quorum.QuorumCnxManager.connectOne(QuorumCnxManager.java:482)
    [junit] 	at org.apache.zookeeper.server.quorum.QuorumCnxManager.toSend(QuorumCnxManager.java:419)
    [junit] 	at org.apache.zookeeper.server.quorum.FastLeaderElection$Messenger$WorkerSender.process(FastLeaderElection.java:486)
    [junit] 	at org.apache.zookeeper.server.quorum.FastLeaderElection$Messenger$WorkerSender.run(FastLeaderElection.java:465)
    [junit] 	at java.lang.Thread.run(Thread.java:745)
    [junit] 2016-11-14 23:32:31,449 [myid:] - INFO  [WorkerReceiver[myid=2]:FastLeaderElection@688]
- Notification: 2 (message format version), 2 (n.leader), 0x200000000 (n.zxid), 0x0 (n.round),
LOOKING (n.state), 2 (n.sid), 0x2 (n.peerEPoch), LOOKING (my state)100000000 (n.config version)
    [junit] 2016-11-14 23:32:31,449 [myid:] - INFO  [WorkerReceiver[myid=1]:FastLeaderElection@688]
- Notification: 2 (message format version), 2 (n.leader), 0x200000000 (n.zxid), 0x0 (n.round),
LOOKING (n.state), 2 (n.sid), 0x2 (n.peerEPoch), LEADING (my state)100000000 (n.config version)
    [junit] 2016-11-14 23:32:31,450 [myid:] - INFO  [WorkerReceiver[myid=2]:FastLeaderElection@688]
- Notification: 2 (message format version), 1 (n.leader), 0x100000000 (n.zxid), 0xffffffffffffffff
(n.round), LEADING (n.state), 1 (n.sid), 0x2 (n.peerEPoch), LOOKING (my state)100000000 (n.config
version)
    [junit] 2016-11-14 23:33:31,451 [myid:] - INFO  [QuorumPeer[myid=2](plain=/127.0.0.1:13952)(secure=disabled):FastLeaderElection@928]
- Notification time out: 60000
    [junit] 2016-11-14 23:33:31,452 [myid:] - WARN  [WorkerSender[myid=2]:QuorumCnxManager@455]
- Cannot open channel to 0 at election address /127.0.0.1:13947
    [junit] java.net.ConnectException: Connection refused
    [junit] 	at java.net.PlainSocketImpl.socketConnect(Native Method)
    [junit] 	at java.net.AbstractPlainSocketImpl.doConnect(AbstractPlainSocketImpl.java:339)
    [junit] 	at java.net.AbstractPlainSocketImpl.connectToAddress(AbstractPlainSocketImpl.java:200)
    [junit] 	at java.net.AbstractPlainSocketImpl.connect(AbstractPlainSocketImpl.java:182)
    [junit] 	at java.net.SocksSocketImpl.connect(SocksSocketImpl.java:392)
    [junit] 	at java.net.Socket.connect(Socket.java:579)
    [junit] 	at org.apache.zookeeper.server.quorum.QuorumCnxManager.connectOne(QuorumCnxManager.java:441)
    [junit] 	at org.apache.zookeeper.server.quorum.QuorumCnxManager.connectOne(QuorumCnxManager.java:482)
    [junit] 	at org.apache.zookeeper.server.quorum.QuorumCnxManager.toSend(QuorumCnxManager.java:419)
    [junit] 	at org.apache.zookeeper.server.quorum.FastLeaderElection$Messenger$WorkerSender.process(FastLeaderElection.java:486)
    [junit] 	at org.apache.zookeeper.server.quorum.FastLeaderElection$Messenger$WorkerSender.run(FastLeaderElection.java:465)
    [junit] 	at java.lang.Thread.run(Thread.java:745)
    [junit] 2016-11-14 23:33:31,453 [myid:] - INFO  [WorkerReceiver[myid=2]:FastLeaderElection@688]
- Notification: 2 (message format version), 2 (n.leader), 0x200000000 (n.zxid), 0x0 (n.round),
LOOKING (n.state), 2 (n.sid), 0x2 (n.peerEPoch), LOOKING (my state)100000000 (n.config version)
    [junit] 2016-11-14 23:33:31,453 [myid:] - INFO  [WorkerReceiver[myid=1]:FastLeaderElection@688]
- Notification: 2 (message format version), 2 (n.leader), 0x200000000 (n.zxid), 0x0 (n.round),
LOOKING (n.state), 2 (n.sid), 0x2 (n.peerEPoch), LEADING (my state)100000000 (n.config version)
    [junit] 2016-11-14 23:33:31,454 [myid:] - INFO  [WorkerReceiver[myid=2]:FastLeaderElection@688]
- Notification: 2 (message format version), 1 (n.leader), 0x100000000 (n.zxid), 0xffffffffffffffff
(n.round), LEADING (n.state), 1 (n.sid), 0x2 (n.peerEPoch), LOOKING (my state)100000000 (n.config
version)
    [junit] Running org.apache.zookeeper.test.CnxManagerTest in thread 2
    [junit] Tests run: 1, Failures: 0, Errors: 1, Skipped: 0, Time elapsed: 0 sec, Thread:
2, Class: org.apache.zookeeper.test.CnxManagerTest
    [junit] Test org.apache.zookeeper.test.CnxManagerTest FAILED (timeout)

BUILD FAILED
/home/jenkins/jenkins-slave/workspace/ZooKeeper-trunk/build.xml:1324: The following error
occurred while executing this line:
/home/jenkins/jenkins-slave/workspace/ZooKeeper-trunk/build.xml:1209: Tests failed!

Total time: 17 minutes 36 seconds
Build step 'Execute shell' marked build as failure
[FINDBUGS] Skipping publisher since build result is FAILURE
[WARNINGS] Skipping publisher since build result is FAILURE
Archiving artifacts
Setting JDK_1_7_LATEST__HOME=/home/jenkins/tools/java/latest1.7
Recording fingerprints
Setting JDK_1_7_LATEST__HOME=/home/jenkins/tools/java/latest1.7
Recording test results
Setting JDK_1_7_LATEST__HOME=/home/jenkins/tools/java/latest1.7
Publishing Javadoc
Setting JDK_1_7_LATEST__HOME=/home/jenkins/tools/java/latest1.7
Setting JDK_1_7_LATEST__HOME=/home/jenkins/tools/java/latest1.7
Email was triggered for: Failure - Any
Sending email for trigger: Failure - Any
Setting JDK_1_7_LATEST__HOME=/home/jenkins/tools/java/latest1.7
Setting JDK_1_7_LATEST__HOME=/home/jenkins/tools/java/latest1.7



###################################################################################
############################## FAILED TESTS (if any) ##############################
2 tests failed.
FAILED:  org.apache.zookeeper.test.CnxManagerTest.testWorkerThreads

Error Message:
Timeout occurred. Please note the time in the report does not reflect the time until the timeout.

Stack Trace:
junit.framework.AssertionFailedError: Timeout occurred. Please note the time in the report
does not reflect the time until the timeout.
	at java.lang.Thread.run(Thread.java:745)


FAILED:  org.apache.zookeeper.test.LETest.testLE

Error Message:
Threads didn't join

Stack Trace:
junit.framework.AssertionFailedError: Threads didn't join
	at org.apache.zookeeper.test.LETest.testLE(LETest.java:123)
	at org.apache.zookeeper.JUnit4ZKTestRunner$LoggedInvokeMethod.evaluate(JUnit4ZKTestRunner.java:79)



Mime
  • Unnamed multipart/mixed (inline, None, 0 bytes)
View raw message