zookeeper-dev mailing list archives

Site index · List index
Message view « Date » · « Thread »
Top « Date » · « Thread »
From Apache Jenkins Server <jenk...@builds.apache.org>
Subject Failed: ZOOKEEPER-2414 PreCommit Build #3536
Date Mon, 28 Nov 2016 20:19:36 GMT
Jira: https://issues.apache.org/jira/browse/ZOOKEEPER-2414
Build: https://builds.apache.org/job/PreCommit-ZOOKEEPER-Build/3536/

###################################################################################
########################## LAST 60 LINES OF THE CONSOLE ###########################
[...truncated 113 lines...]
     [exec] PATCH APPLICATION FAILED
     [exec] 
     [exec] 
     [exec] 
     [exec] 
     [exec] -1 overall.  Here are the results of testing the latest attachment 
     [exec]   http://issues.apache.org/jira/secure/attachment/12840709/ZOOKEEPER-2414.patch
     [exec]   against trunk revision d72f27279a13986ee0c011e1e5b34edf3a310da9.
     [exec] 
     [exec]     +1 @author.  The patch does not contain any @author tags.
     [exec] 
     [exec]     +1 tests included.  The patch appears to include 3 new or modified tests.
     [exec] 
     [exec]     -1 patch.  The patch command could not apply the patch.
     [exec] 
     [exec] Console output: https://builds.apache.org/job/PreCommit-ZOOKEEPER-Build/3536//console
     [exec] 
     [exec] This message is automatically generated.
     [exec] 
     [exec] 
     [exec] ======================================================================
     [exec] ======================================================================
     [exec]     Adding comment to Jira.
     [exec] ======================================================================
     [exec] ======================================================================
     [exec] 
     [exec] 
     [exec] Comment added.
     [exec] 20db640ed8a795a29e755093c23ed580be9b79e7 logged out
     [exec] 
     [exec] 
     [exec] ======================================================================
     [exec] ======================================================================
     [exec]     Finished build.
     [exec] ======================================================================
     [exec] ======================================================================
     [exec] 
     [exec] 
     [exec] mv: '/home/jenkins/jenkins-slave/workspace/PreCommit-ZOOKEEPER-Build/patchprocess'
and '/home/jenkins/jenkins-slave/workspace/PreCommit-ZOOKEEPER-Build/patchprocess' are the
same file

BUILD FAILED
/home/jenkins/jenkins-slave/workspace/PreCommit-ZOOKEEPER-Build/build.xml:1607: exec returned:
1

Total time: 43 seconds
Build step 'Execute shell' marked build as failure
Archiving artifacts
Setting JDK_1_7_LATEST__HOME=/home/jenkins/tools/java/latest1.7
Recording test results
Setting JDK_1_7_LATEST__HOME=/home/jenkins/tools/java/latest1.7
ERROR: Step ?Publish JUnit test result report? failed: No test report files were found. Configuration
error?
Setting JDK_1_7_LATEST__HOME=/home/jenkins/tools/java/latest1.7
[description-setter] Description set: ZOOKEEPER-2414
Setting JDK_1_7_LATEST__HOME=/home/jenkins/tools/java/latest1.7
Email was triggered for: Failure - Any
Sending email for trigger: Failure - Any
Setting JDK_1_7_LATEST__HOME=/home/jenkins/tools/java/latest1.7
Setting JDK_1_7_LATEST__HOME=/home/jenkins/tools/java/latest1.7
Setting JDK_1_7_LATEST__HOME=/home/jenkins/tools/java/latest1.7
Setting JDK_1_7_LATEST__HOME=/home/jenkins/tools/java/latest1.7



###################################################################################
############################## FAILED TESTS (if any) ##############################
No tests ran.
Mime
  • Unnamed multipart/mixed (inline, None, 0 bytes)
View raw message