zookeeper-dev mailing list archives

Site index · List index
Message view « Date » · « Thread »
Top « Date » · « Thread »
From Apache Jenkins Server <jenk...@builds.apache.org>
Subject ZooKeeper_branch34_solaris - Build # 1344 - Still Failing
Date Tue, 01 Nov 2016 13:58:30 GMT
See https://builds.apache.org/job/ZooKeeper_branch34_solaris/1344/

###################################################################################
########################## LAST 60 LINES OF THE CONSOLE ###########################
[...truncated 124671 lines...]
    [junit] 	at org.junit.runners.ParentRunner.run(ParentRunner.java:236)
    [junit] 	at junit.framework.JUnit4TestAdapter.run(JUnit4TestAdapter.java:39)
    [junit] 	at org.apache.tools.ant.taskdefs.optional.junit.JUnitTestRunner.run(JUnitTestRunner.java:518)
    [junit] 	at org.apache.tools.ant.taskdefs.optional.junit.JUnitTestRunner.launch(JUnitTestRunner.java:1052)
    [junit] 	at org.apache.tools.ant.taskdefs.optional.junit.JUnitTestRunner.main(JUnitTestRunner.java:906)
    [junit] 2016-11-01 13:59:15,576 [myid:] - INFO  [main:ZooKeeperServer@497] - shutting
down
    [junit] 2016-11-01 13:59:15,577 [myid:] - INFO  [main:SessionTrackerImpl@225] - Shutting
down
    [junit] 2016-11-01 13:59:15,577 [myid:] - INFO  [main:PrepRequestProcessor@765] - Shutting
down
    [junit] 2016-11-01 13:59:15,576 [myid:] - INFO  [LearnerCnxAcceptor-/127.0.0.1:12237:Leader$LearnerCnxAcceptor@325]
- exception while shutting down acceptor: java.net.SocketException: Socket closed
    [junit] 2016-11-01 13:59:15,577 [myid:] - INFO  [ProcessThread(sid:5 cport:-1)::PrepRequestProcessor@143]
- PrepRequestProcessor exited loop!
    [junit] 2016-11-01 13:59:15,577 [myid:] - INFO  [main:ProposalRequestProcessor@88] - Shutting
down
    [junit] 2016-11-01 13:59:15,577 [myid:] - INFO  [main:CommitProcessor@184] - Shutting
down
    [junit] 2016-11-01 13:59:15,577 [myid:] - INFO  [main:Leader$ToBeAppliedRequestProcessor@667]
- Shutting down
    [junit] 2016-11-01 13:59:15,578 [myid:] - INFO  [main:FinalRequestProcessor@402] - shutdown
of request processor complete
    [junit] 2016-11-01 13:59:15,578 [myid:] - INFO  [main:SyncRequestProcessor@208] - Shutting
down
    [junit] 2016-11-01 13:59:15,577 [myid:] - INFO  [CommitProcessor:5:CommitProcessor@153]
- CommitProcessor exited loop!
    [junit] 2016-11-01 13:59:15,578 [myid:] - INFO  [SyncThread:5:SyncRequestProcessor@186]
- SyncRequestProcessor exited!
    [junit] 2016-11-01 13:59:15,579 [myid:] - ERROR [/127.0.0.1:12242:QuorumCnxManager$Listener@547]
- Exception while listening
    [junit] java.net.SocketException: Socket closed
    [junit] 	at java.net.PlainSocketImpl.socketAccept(Native Method)
    [junit] 	at java.net.PlainSocketImpl.accept(PlainSocketImpl.java:408)
    [junit] 	at java.net.ServerSocket.implAccept(ServerSocket.java:462)
    [junit] 	at java.net.ServerSocket.accept(ServerSocket.java:430)
    [junit] 	at org.apache.zookeeper.server.quorum.QuorumCnxManager$Listener.run(QuorumCnxManager.java:539)
    [junit] 2016-11-01 13:59:15,579 [myid:] - WARN  [QuorumPeer[myid=5]/0.0.0.0:11237:QuorumPeer@862]
- Unexpected exception
    [junit] java.lang.InterruptedException: sleep interrupted
    [junit] 	at java.lang.Thread.sleep(Native Method)
    [junit] 	at org.apache.zookeeper.server.quorum.Leader.lead(Leader.java:456)
    [junit] 	at org.apache.zookeeper.server.quorum.QuorumPeer.run(QuorumPeer.java:859)
    [junit] 2016-11-01 13:59:15,580 [myid:] - INFO  [QuorumPeer[myid=5]/0.0.0.0:11237:Leader@502]
- Shutting down
    [junit] 2016-11-01 13:59:15,579 [myid:] - INFO  [main:QuorumBase@310] - Shutting down
leader election QuorumPeer[myid=5]/0.0.0.0:11237
    [junit] 2016-11-01 13:59:15,580 [myid:] - WARN  [QuorumPeer[myid=5]/0.0.0.0:11237:QuorumPeer@874]
- QuorumPeer main thread exited
    [junit] 2016-11-01 13:59:15,580 [myid:] - INFO  [main:QuorumBase@315] - Waiting for QuorumPeer[myid=5]/0.0.0.0:11237
to exit thread
    [junit] 2016-11-01 13:59:15,580 [myid:] - INFO  [main:FourLetterWordMain@62] - connecting
to 127.0.0.1 11233
    [junit] 2016-11-01 13:59:15,580 [myid:] - INFO  [main:QuorumBase@291] - 127.0.0.1:11233
is no longer accepting client connections
    [junit] 2016-11-01 13:59:15,580 [myid:] - INFO  [main:FourLetterWordMain@62] - connecting
to 127.0.0.1 11234
    [junit] 2016-11-01 13:59:15,581 [myid:] - INFO  [main:QuorumBase@291] - 127.0.0.1:11234
is no longer accepting client connections
    [junit] 2016-11-01 13:59:15,581 [myid:] - INFO  [main:FourLetterWordMain@62] - connecting
to 127.0.0.1 11235
    [junit] 2016-11-01 13:59:15,581 [myid:] - INFO  [main:QuorumBase@291] - 127.0.0.1:11235
is no longer accepting client connections
    [junit] 2016-11-01 13:59:15,581 [myid:] - INFO  [main:FourLetterWordMain@62] - connecting
to 127.0.0.1 11236
    [junit] 2016-11-01 13:59:15,581 [myid:] - INFO  [main:QuorumBase@291] - 127.0.0.1:11236
is no longer accepting client connections
    [junit] 2016-11-01 13:59:15,581 [myid:] - INFO  [main:FourLetterWordMain@62] - connecting
to 127.0.0.1 11237
    [junit] 2016-11-01 13:59:15,582 [myid:] - INFO  [main:QuorumBase@291] - 127.0.0.1:11237
is no longer accepting client connections
    [junit] 2016-11-01 13:59:15,583 [myid:] - INFO  [main:ZKTestCase$1@65] - SUCCEEDED testNull
    [junit] 2016-11-01 13:59:15,583 [myid:] - INFO  [main:ZKTestCase$1@60] - FINISHED testNull
    [junit] Tests run: 2, Failures: 0, Errors: 0, Time elapsed: 20.119 sec
    [junit] Running org.apache.zookeeper.test.QuorumTest
    [junit] Tests run: 1, Failures: 0, Errors: 1, Time elapsed: 0 sec

BUILD FAILED
/zonestorage/hudson_solaris/home/hudson/hudson-slave/workspace/ZooKeeper_branch34_solaris/build.xml:1289:
Process fork failed.

Total time: 33 minutes 48 seconds
Build step 'Invoke Ant' marked build as failure
[locks-and-latches] Releasing all the locks
[locks-and-latches] All the locks released
Recording test results
Email was triggered for: Failure - Any
Sending email for trigger: Failure - Any



###################################################################################
############################## FAILED TESTS (if any) ##############################
1 tests failed.
FAILED:  org.apache.zookeeper.test.QuorumTest.unknown

Error Message:
Forked Java VM exited abnormally. Please note the time in the report does not reflect the
time until the VM exit.

Stack Trace:
junit.framework.AssertionFailedError: Forked Java VM exited abnormally. Please note the time
in the report does not reflect the time until the VM exit.



Mime
  • Unnamed multipart/mixed (inline, None, 0 bytes)
View raw message