zookeeper-dev mailing list archives

Site index · List index
Message view « Date » · « Thread »
Top « Date » · « Thread »
From Apache Jenkins Server <jenk...@builds.apache.org>
Subject ZooKeeper-trunk-solaris - Build # 1365 - Still Failing
Date Sat, 29 Oct 2016 08:26:48 GMT
See https://builds.apache.org/job/ZooKeeper-trunk-solaris/1365/

###################################################################################
########################## LAST 60 LINES OF THE CONSOLE ###########################
[...truncated 438316 lines...]
    [junit] 2016-10-29 08:26:46,256 [myid:] - INFO  [main:NIOServerCnxnFactory@686] - binding
to port 0.0.0.0/0.0.0.0:11222
    [junit] 2016-10-29 08:26:46,256 [myid:] - INFO  [main:ClientBase@361] - STARTING server
instance 127.0.0.1:11222
    [junit] 2016-10-29 08:26:46,256 [myid:] - INFO  [main:ZooKeeperServer@889] - minSessionTimeout
set to 6000
    [junit] 2016-10-29 08:26:46,257 [myid:] - INFO  [main:ZooKeeperServer@898] - maxSessionTimeout
set to 60000
    [junit] 2016-10-29 08:26:46,257 [myid:] - INFO  [main:ZooKeeperServer@159] - Created server
with tickTime 3000 minSessionTimeout 6000 maxSessionTimeout 60000 datadir /zonestorage/hudson_solaris/home/hudson/hudson-slave/workspace/ZooKeeper-trunk-solaris/build/test/tmp/test4501138394268466972.junit.dir/version-2
snapdir /zonestorage/hudson_solaris/home/hudson/hudson-slave/workspace/ZooKeeper-trunk-solaris/build/test/tmp/test4501138394268466972.junit.dir/version-2
    [junit] 2016-10-29 08:26:46,257 [myid:] - INFO  [main:FileSnap@83] - Reading snapshot
/zonestorage/hudson_solaris/home/hudson/hudson-slave/workspace/ZooKeeper-trunk-solaris/build/test/tmp/test4501138394268466972.junit.dir/version-2/snapshot.b
    [junit] 2016-10-29 08:26:46,259 [myid:] - INFO  [main:FileTxnSnapLog@306] - Snapshotting:
0xb to /zonestorage/hudson_solaris/home/hudson/hudson-slave/workspace/ZooKeeper-trunk-solaris/build/test/tmp/test4501138394268466972.junit.dir/version-2/snapshot.b
    [junit] 2016-10-29 08:26:46,261 [myid:] - INFO  [SessionTracker:SessionTrackerImpl@158]
- SessionTrackerImpl exited loop!
    [junit] 2016-10-29 08:26:46,261 [myid:] - ERROR [main:ZooKeeperServer@501] - ZKShutdownHandler
is not registered, so ZooKeeper server won't take any action on ERROR or SHUTDOWN server state
changes
    [junit] 2016-10-29 08:26:46,261 [myid:] - INFO  [SessionTracker:SessionTrackerImpl@158]
- SessionTrackerImpl exited loop!
    [junit] 2016-10-29 08:26:46,261 [myid:] - INFO  [main:FourLetterWordMain@85] - connecting
to 127.0.0.1 11222
    [junit] 2016-10-29 08:26:46,262 [myid:] - INFO  [NIOServerCxnFactory.AcceptThread:0.0.0.0/0.0.0.0:11222:NIOServerCnxnFactory$AcceptThread@296]
- Accepted socket connection from /127.0.0.1:59805
    [junit] 2016-10-29 08:26:46,262 [myid:] - INFO  [NIOWorkerThread-1:NIOServerCnxn@485]
- Processing stat command from /127.0.0.1:59805
    [junit] 2016-10-29 08:26:46,262 [myid:] - INFO  [NIOWorkerThread-1:StatCommand@49] - Stat
command output
    [junit] 2016-10-29 08:26:46,263 [myid:] - INFO  [NIOWorkerThread-1:NIOServerCnxn@607]
- Closed socket connection for client /127.0.0.1:59805 (no session established for client)
    [junit] 2016-10-29 08:26:46,263 [myid:] - INFO  [main:JMXEnv@228] - ensureParent:[InMemoryDataTree,
StandaloneServer_port]
    [junit] 2016-10-29 08:26:46,264 [myid:] - INFO  [main:JMXEnv@245] - expect:InMemoryDataTree
    [junit] 2016-10-29 08:26:46,264 [myid:] - INFO  [main:JMXEnv@249] - found:InMemoryDataTree
org.apache.ZooKeeperService:name0=StandaloneServer_port11222,name1=InMemoryDataTree
    [junit] 2016-10-29 08:26:46,264 [myid:] - INFO  [main:JMXEnv@245] - expect:StandaloneServer_port
    [junit] 2016-10-29 08:26:46,265 [myid:] - INFO  [main:JMXEnv@249] - found:StandaloneServer_port
org.apache.ZooKeeperService:name0=StandaloneServer_port11222
    [junit] 2016-10-29 08:26:46,265 [myid:] - INFO  [main:JUnit4ZKTestRunner$LoggedInvokeMethod@82]
- Memory used 18005
    [junit] 2016-10-29 08:26:46,265 [myid:] - INFO  [main:JUnit4ZKTestRunner$LoggedInvokeMethod@87]
- Number of threads 22
    [junit] 2016-10-29 08:26:46,265 [myid:] - INFO  [main:JUnit4ZKTestRunner$LoggedInvokeMethod@102]
- FINISHED TEST METHOD testQuota
    [junit] 2016-10-29 08:26:46,265 [myid:] - INFO  [main:ClientBase@543] - tearDown starting
    [junit] 2016-10-29 08:26:46,342 [myid:] - INFO  [main:ZooKeeper@1315] - Session: 0x1248c87052e0000
closed
    [junit] 2016-10-29 08:26:46,342 [myid:] - INFO  [main-EventThread:ClientCnxn$EventThread@513]
- EventThread shut down for session: 0x1248c87052e0000
    [junit] 2016-10-29 08:26:46,342 [myid:] - INFO  [main:ClientBase@513] - STOPPING server
    [junit] 2016-10-29 08:26:46,343 [myid:] - INFO  [NIOServerCxnFactory.AcceptThread:0.0.0.0/0.0.0.0:11222:NIOServerCnxnFactory$AcceptThread@219]
- accept thread exitted run method
    [junit] 2016-10-29 08:26:46,343 [myid:] - INFO  [NIOServerCxnFactory.SelectorThread-0:NIOServerCnxnFactory$SelectorThread@420]
- selector thread exitted run method
    [junit] 2016-10-29 08:26:46,343 [myid:] - INFO  [NIOServerCxnFactory.SelectorThread-1:NIOServerCnxnFactory$SelectorThread@420]
- selector thread exitted run method
    [junit] 2016-10-29 08:26:46,343 [myid:] - INFO  [ConnnectionExpirer:NIOServerCnxnFactory$ConnectionExpirerThread@583]
- ConnnectionExpirerThread interrupted
    [junit] 2016-10-29 08:26:46,343 [myid:] - INFO  [main:ZooKeeperServer@529] - shutting
down
    [junit] 2016-10-29 08:26:46,343 [myid:] - ERROR [main:ZooKeeperServer@501] - ZKShutdownHandler
is not registered, so ZooKeeper server won't take any action on ERROR or SHUTDOWN server state
changes
    [junit] 2016-10-29 08:26:46,344 [myid:] - INFO  [main:SessionTrackerImpl@232] - Shutting
down
    [junit] 2016-10-29 08:26:46,344 [myid:] - INFO  [main:PrepRequestProcessor@996] - Shutting
down
    [junit] 2016-10-29 08:26:46,344 [myid:] - INFO  [main:SyncRequestProcessor@191] - Shutting
down
    [junit] 2016-10-29 08:26:46,344 [myid:] - INFO  [ProcessThread(sid:0 cport:11222)::PrepRequestProcessor@156]
- PrepRequestProcessor exited loop!
    [junit] 2016-10-29 08:26:46,344 [myid:] - INFO  [SyncThread:0:SyncRequestProcessor@169]
- SyncRequestProcessor exited!
    [junit] 2016-10-29 08:26:46,344 [myid:] - INFO  [main:FinalRequestProcessor@481] - shutdown
of request processor complete
    [junit] 2016-10-29 08:26:46,345 [myid:] - INFO  [main:MBeanRegistry@128] - Unregister
MBean [org.apache.ZooKeeperService:name0=StandaloneServer_port11222,name1=InMemoryDataTree]
    [junit] 2016-10-29 08:26:46,345 [myid:] - INFO  [main:MBeanRegistry@128] - Unregister
MBean [org.apache.ZooKeeperService:name0=StandaloneServer_port11222]
    [junit] 2016-10-29 08:26:46,345 [myid:] - INFO  [main:FourLetterWordMain@85] - connecting
to 127.0.0.1 11222
    [junit] 2016-10-29 08:26:46,345 [myid:] - INFO  [main:JMXEnv@146] - ensureOnly:[]
    [junit] 2016-10-29 08:26:46,349 [myid:] - INFO  [main:ClientBase@568] - fdcount after
test is: 60 at start it was 43
    [junit] 2016-10-29 08:26:46,349 [myid:] - INFO  [main:ClientBase@570] - sleeping for 20
secs
    [junit] 2016-10-29 08:26:46,351 [myid:] - INFO  [main:ZKTestCase$1@65] - SUCCEEDED testQuota
    [junit] 2016-10-29 08:26:46,351 [myid:] - INFO  [main:ZKTestCase$1@60] - FINISHED testQuota
    [junit] Tests run: 1, Failures: 0, Errors: 0, Time elapsed: 0.975 sec

BUILD FAILED
/zonestorage/hudson_solaris/home/hudson/hudson-slave/workspace/ZooKeeper-trunk-solaris/build.xml:1233:
Tests failed!

Total time: 69 minutes 27 seconds
Build step 'Invoke Ant' marked build as failure
[locks-and-latches] Releasing all the locks
[locks-and-latches] All the locks released
Recording test results
Email was triggered for: Failure - Any
Sending email for trigger: Failure - Any



###################################################################################
############################## FAILED TESTS (if any) ##############################
3 tests failed.
FAILED:  org.apache.zookeeper.test.LETest.testLE

Error Message:
Threads didn't join

Stack Trace:
junit.framework.AssertionFailedError: Threads didn't join
	at org.apache.zookeeper.test.LETest.testLE(LETest.java:123)
	at org.apache.zookeeper.JUnit4ZKTestRunner$LoggedInvokeMethod.evaluate(JUnit4ZKTestRunner.java:79)


FAILED:  org.apache.zookeeper.test.ReconfigTest.testPortChangeToBlockedPortLeader

Error Message:
client could not connect to reestablished quorum: giving up after 30+ seconds.

Stack Trace:
junit.framework.AssertionFailedError: client could not connect to reestablished quorum: giving
up after 30+ seconds.
	at org.apache.zookeeper.test.ReconfigTest.testNormalOperation(ReconfigTest.java:173)
	at org.apache.zookeeper.test.ReconfigTest.testPortChangeToBlockedPort(ReconfigTest.java:732)
	at org.apache.zookeeper.test.ReconfigTest.testPortChangeToBlockedPortLeader(ReconfigTest.java:662)
	at org.apache.zookeeper.JUnit4ZKTestRunner$LoggedInvokeMethod.evaluate(JUnit4ZKTestRunner.java:79)


FAILED:  org.apache.zookeeper.test.ReconfigTest.testPortChangeToBlockedPortFollower

Error Message:
client could not connect to reestablished quorum: giving up after 30+ seconds.

Stack Trace:
junit.framework.AssertionFailedError: client could not connect to reestablished quorum: giving
up after 30+ seconds.
	at org.apache.zookeeper.test.ReconfigTest.testNormalOperation(ReconfigTest.java:173)
	at org.apache.zookeeper.test.ReconfigTest.testPortChangeToBlockedPort(ReconfigTest.java:732)
	at org.apache.zookeeper.test.ReconfigTest.testPortChangeToBlockedPortFollower(ReconfigTest.java:658)
	at org.apache.zookeeper.JUnit4ZKTestRunner$LoggedInvokeMethod.evaluate(JUnit4ZKTestRunner.java:79)



Mime
  • Unnamed multipart/mixed (inline, None, 0 bytes)
View raw message