zookeeper-dev mailing list archives

Site index · List index
Message view « Date » · « Thread »
Top « Date » · « Thread »
From Apache Jenkins Server <jenk...@builds.apache.org>
Subject ZooKeeper_branch34_solaris - Build # 1322 - Failure
Date Tue, 11 Oct 2016 13:35:07 GMT
See https://builds.apache.org/job/ZooKeeper_branch34_solaris/1322/

###################################################################################
########################## LAST 60 LINES OF THE CONSOLE ###########################
[...truncated 15048 lines...]
    [junit] 	at org.apache.zookeeper.server.quorum.QuorumCnxManager.pollSendQueue(QuorumCnxManager.java:879)
    [junit] 	at org.apache.zookeeper.server.quorum.QuorumCnxManager.access$500(QuorumCnxManager.java:65)
    [junit] 	at org.apache.zookeeper.server.quorum.QuorumCnxManager$SendWorker.run(QuorumCnxManager.java:715)
    [junit] 2016-10-11 13:36:12,347 [myid:] - WARN  [RecvWorker:2:QuorumCnxManager$RecvWorker@813]
- Interrupting SendWorker
    [junit] 2016-10-11 13:36:12,345 [myid:] - INFO  [QuorumPeer[myid=2]/0.0.0.0:11275:SyncRequestProcessor@208]
- Shutting down
    [junit] 2016-10-11 13:36:12,345 [myid:] - WARN  [RecvWorker:1:QuorumCnxManager$RecvWorker@810]
- Connection broken for id 1, my id = 2, error = 
    [junit] java.io.EOFException
    [junit] 	at java.io.DataInputStream.readInt(DataInputStream.java:375)
    [junit] 	at org.apache.zookeeper.server.quorum.QuorumCnxManager$RecvWorker.run(QuorumCnxManager.java:795)
    [junit] 2016-10-11 13:36:12,348 [myid:] - WARN  [RecvWorker:1:QuorumCnxManager$RecvWorker@813]
- Interrupting SendWorker
    [junit] 2016-10-11 13:36:12,345 [myid:] - WARN  [QuorumPeer[myid=1]/0.0.0.0:11272:QuorumPeer@862]
- Unexpected exception
    [junit] java.lang.InterruptedException: sleep interrupted
    [junit] 	at java.lang.Thread.sleep(Native Method)
    [junit] 	at org.apache.zookeeper.server.quorum.Leader.lead(Leader.java:456)
    [junit] 	at org.apache.zookeeper.server.quorum.QuorumPeer.run(QuorumPeer.java:859)
    [junit] 2016-10-11 13:36:12,348 [myid:] - WARN  [SendWorker:1:QuorumCnxManager$SendWorker@727]
- Interrupted while waiting for message on queue
    [junit] java.lang.InterruptedException
    [junit] 	at java.util.concurrent.locks.AbstractQueuedSynchronizer$ConditionObject.reportInterruptAfterWait(AbstractQueuedSynchronizer.java:1961)
    [junit] 	at java.util.concurrent.locks.AbstractQueuedSynchronizer$ConditionObject.awaitNanos(AbstractQueuedSynchronizer.java:2038)
    [junit] 	at java.util.concurrent.ArrayBlockingQueue.poll(ArrayBlockingQueue.java:342)
    [junit] 	at org.apache.zookeeper.server.quorum.QuorumCnxManager.pollSendQueue(QuorumCnxManager.java:879)
    [junit] 	at org.apache.zookeeper.server.quorum.QuorumCnxManager.access$500(QuorumCnxManager.java:65)
    [junit] 	at org.apache.zookeeper.server.quorum.QuorumCnxManager$SendWorker.run(QuorumCnxManager.java:715)
    [junit] 2016-10-11 13:36:12,348 [myid:] - WARN  [SendWorker:1:QuorumCnxManager$SendWorker@736]
- Send worker leaving thread
    [junit] 2016-10-11 13:36:12,348 [myid:] - INFO  [SyncThread:2:SyncRequestProcessor@186]
- SyncRequestProcessor exited!
    [junit] 2016-10-11 13:36:12,347 [myid:] - WARN  [SendWorker:2:QuorumCnxManager$SendWorker@736]
- Send worker leaving thread
    [junit] 2016-10-11 13:36:12,346 [myid:] - INFO  [main:FollowerZooKeeperServer@140] - Shutting
down
    [junit] 2016-10-11 13:36:12,349 [myid:] - WARN  [QuorumPeer[myid=2]/0.0.0.0:11275:QuorumPeer@874]
- QuorumPeer main thread exited
    [junit] 2016-10-11 13:36:12,348 [myid:] - INFO  [QuorumPeer[myid=1]/0.0.0.0:11272:Leader@502]
- Shutting down
    [junit] 2016-10-11 13:36:12,349 [myid:] - INFO  [main:SyncRequestProcessor@208] - Shutting
down
    [junit] 2016-10-11 13:36:12,349 [myid:] - WARN  [QuorumPeer[myid=1]/0.0.0.0:11272:QuorumPeer@874]
- QuorumPeer main thread exited
    [junit] 2016-10-11 13:36:12,350 [myid:] - ERROR [/0.0.0.0:11276:QuorumCnxManager$Listener@547]
- Exception while listening
    [junit] java.net.SocketException: Socket closed
    [junit] 	at java.net.PlainSocketImpl.socketAccept(Native Method)
    [junit] 	at java.net.PlainSocketImpl.accept(PlainSocketImpl.java:408)
    [junit] 	at java.net.ServerSocket.implAccept(ServerSocket.java:462)
    [junit] 	at java.net.ServerSocket.accept(ServerSocket.java:430)
    [junit] 	at org.apache.zookeeper.server.quorum.QuorumCnxManager$Listener.run(QuorumCnxManager.java:539)
    [junit] 2016-10-11 13:36:12,350 [myid:] - INFO  [main:JUnit4ZKTestRunner$LoggedInvokeMethod@58]
- Memory used 14266
    [junit] 2016-10-11 13:36:12,351 [myid:] - INFO  [main:JUnit4ZKTestRunner$LoggedInvokeMethod@63]
- Number of threads 26
    [junit] 2016-10-11 13:36:12,351 [myid:] - INFO  [main:JUnit4ZKTestRunner$LoggedInvokeMethod@78]
- FINISHED TEST METHOD testWorkerThreads
    [junit] 2016-10-11 13:36:12,351 [myid:] - INFO  [main:ZKTestCase$1@65] - SUCCEEDED testWorkerThreads
    [junit] 2016-10-11 13:36:12,351 [myid:] - INFO  [main:ZKTestCase$1@60] - FINISHED testWorkerThreads
    [junit] 2016-10-11 13:36:12,371 [myid:] - INFO  [WorkerReceiver[myid=2]:FastLeaderElection$Messenger$WorkerReceiver@407]
- WorkerReceiver is down
    [junit] 2016-10-11 13:36:12,371 [myid:] - INFO  [WorkerSender[myid=2]:FastLeaderElection$Messenger$WorkerSender@438]
- WorkerSender is down
    [junit] Tests run: 6, Failures: 0, Errors: 0, Time elapsed: 41.15 sec
    [junit] Running org.apache.zookeeper.server.quorum.FLEBackwardElectionRoundTest
    [junit] Tests run: 1, Failures: 0, Errors: 1, Time elapsed: 0 sec

BUILD FAILED
/zonestorage/hudson_solaris/home/hudson/hudson-slave/workspace/ZooKeeper_branch34_solaris/build.xml:1289:
Process fork failed.

Total time: 11 minutes 0 seconds
Build step 'Invoke Ant' marked build as failure
[locks-and-latches] Releasing all the locks
[locks-and-latches] All the locks released
Recording test results
Email was triggered for: Failure - Any
Sending email for trigger: Failure - Any



###################################################################################
############################## FAILED TESTS (if any) ##############################
1 tests failed.
FAILED:  org.apache.zookeeper.server.quorum.FLEBackwardElectionRoundTest.unknown

Error Message:
Forked Java VM exited abnormally. Please note the time in the report does not reflect the
time until the VM exit.

Stack Trace:
junit.framework.AssertionFailedError: Forked Java VM exited abnormally. Please note the time
in the report does not reflect the time until the VM exit.



Mime
  • Unnamed multipart/mixed (inline, None, 0 bytes)
View raw message