zookeeper-dev mailing list archives

Site index · List index
Message view « Date » · « Thread »
Top « Date » · « Thread »
From Apache Jenkins Server <jenk...@builds.apache.org>
Subject ZooKeeper-trunk-jdk8 - Build # 797 - Still Failing
Date Wed, 26 Oct 2016 12:01:33 GMT
See https://builds.apache.org/job/ZooKeeper-trunk-jdk8/797/

###################################################################################
########################## LAST 60 LINES OF THE CONSOLE ###########################
[...truncated 437329 lines...]
    [junit] 	at org.apache.zookeeper.ClientCnxnSocketNIO.doTransport(ClientCnxnSocketNIO.java:357)
    [junit] 	at org.apache.zookeeper.ClientCnxn$SendThread.run(ClientCnxn.java:1214)
    [junit] 2016-10-26 11:55:27,955 [myid:] - INFO  [ProcessThread(sid:0 cport:11466)::PrepRequestProcessor@605]
- Processed session termination for sessionid: 0x100180344bd0000
    [junit] 2016-10-26 11:55:27,957 [myid:] - WARN  [New I/O worker #1811:NettyServerCnxnFactory$CnxnChannelHandler@142]
- Exception caught [id: 0x0a7b4f50, /127.0.0.1:44006 :> /127.0.0.1:11466] EXCEPTION: java.nio.channels.ClosedChannelException
    [junit] java.nio.channels.ClosedChannelException
    [junit] 	at sun.nio.ch.SocketChannelImpl.ensureWriteOpen(SocketChannelImpl.java:270)
    [junit] 	at sun.nio.ch.SocketChannelImpl.write(SocketChannelImpl.java:461)
    [junit] 	at org.jboss.netty.channel.socket.nio.SocketSendBufferPool$UnpooledSendBuffer.transferTo(SocketSendBufferPool.java:203)
    [junit] 	at org.jboss.netty.channel.socket.nio.AbstractNioWorker.write0(AbstractNioWorker.java:201)
    [junit] 	at org.jboss.netty.channel.socket.nio.AbstractNioWorker.writeFromTaskLoop(AbstractNioWorker.java:151)
    [junit] 	at org.jboss.netty.channel.socket.nio.AbstractNioChannel$WriteTask.run(AbstractNioChannel.java:315)
    [junit] 	at org.jboss.netty.channel.socket.nio.AbstractNioSelector.processTaskQueue(AbstractNioSelector.java:391)
    [junit] 	at org.jboss.netty.channel.socket.nio.AbstractNioSelector.run(AbstractNioSelector.java:315)
    [junit] 	at org.jboss.netty.channel.socket.nio.AbstractNioWorker.run(AbstractNioWorker.java:89)
    [junit] 	at org.jboss.netty.channel.socket.nio.NioWorker.run(NioWorker.java:178)
    [junit] 	at org.jboss.netty.util.ThreadRenamingRunnable.run(ThreadRenamingRunnable.java:108)
    [junit] 	at org.jboss.netty.util.internal.DeadLockProofWorker$1.run(DeadLockProofWorker.java:42)
    [junit] 	at java.util.concurrent.ThreadPoolExecutor.runWorker(ThreadPoolExecutor.java:1142)
    [junit] 	at java.util.concurrent.ThreadPoolExecutor$Worker.run(ThreadPoolExecutor.java:617)
    [junit] 	at java.lang.Thread.run(Thread.java:745)
    [junit] 2016-10-26 11:55:27,957 [myid:] - INFO  [SyncThread:0:MBeanRegistry@128] - Unregister
MBean [org.apache.ZooKeeperService:name0=StandaloneServer_port11466,name1=Connections,name2=127.0.0.1,name3=0x100180344bd0000]
    [junit] 2016-10-26 11:55:28,049 [myid:] - INFO  [SessionTracker:SessionTrackerImpl@158]
- SessionTrackerImpl exited loop!
    [junit] 2016-10-26 11:55:28,057 [myid:] - INFO  [main:ZooKeeper@1315] - Session: 0x100180344bd0000
closed
    [junit] 2016-10-26 11:55:28,058 [myid:] - INFO  [main:JUnit4ZKTestRunner$LoggedInvokeMethod@82]
- Memory used 92092
    [junit] 2016-10-26 11:55:28,058 [myid:] - INFO  [main:JUnit4ZKTestRunner$LoggedInvokeMethod@87]
- Number of threads 467
    [junit] 2016-10-26 11:55:28,058 [myid:] - INFO  [main:JUnit4ZKTestRunner$LoggedInvokeMethod@102]
- FINISHED TEST METHOD testWatcherAutoResetWithLocal
    [junit] 2016-10-26 11:55:28,058 [myid:] - INFO  [main:ClientBase@543] - tearDown starting
    [junit] 2016-10-26 11:55:28,058 [myid:] - INFO  [main:ClientBase@513] - STOPPING server
    [junit] 2016-10-26 11:55:28,058 [myid:] - INFO  [main:NettyServerCnxnFactory@464] - shutdown
called 0.0.0.0/0.0.0.0:11466
    [junit] 2016-10-26 11:55:28,058 [myid:] - INFO  [main-EventThread:ClientCnxn$EventThread@513]
- EventThread shut down for session: 0x100180344bd0000
    [junit] 2016-10-26 11:55:28,059 [myid:] - INFO  [main:ZooKeeperServer@529] - shutting
down
    [junit] 2016-10-26 11:55:28,059 [myid:] - ERROR [main:ZooKeeperServer@501] - ZKShutdownHandler
is not registered, so ZooKeeper server won't take any action on ERROR or SHUTDOWN server state
changes
    [junit] 2016-10-26 11:55:28,059 [myid:] - INFO  [main:SessionTrackerImpl@232] - Shutting
down
    [junit] 2016-10-26 11:55:28,059 [myid:] - INFO  [main:PrepRequestProcessor@996] - Shutting
down
    [junit] 2016-10-26 11:55:28,060 [myid:] - INFO  [main:SyncRequestProcessor@191] - Shutting
down
    [junit] 2016-10-26 11:55:28,060 [myid:] - INFO  [ProcessThread(sid:0 cport:11466)::PrepRequestProcessor@156]
- PrepRequestProcessor exited loop!
    [junit] 2016-10-26 11:55:28,060 [myid:] - INFO  [SyncThread:0:SyncRequestProcessor@169]
- SyncRequestProcessor exited!
    [junit] 2016-10-26 11:55:28,060 [myid:] - INFO  [main:FinalRequestProcessor@481] - shutdown
of request processor complete
    [junit] 2016-10-26 11:55:28,060 [myid:] - INFO  [main:MBeanRegistry@128] - Unregister
MBean [org.apache.ZooKeeperService:name0=StandaloneServer_port11466,name1=InMemoryDataTree]
    [junit] 2016-10-26 11:55:28,060 [myid:] - INFO  [main:MBeanRegistry@128] - Unregister
MBean [org.apache.ZooKeeperService:name0=StandaloneServer_port11466]
    [junit] 2016-10-26 11:55:28,061 [myid:] - INFO  [main:FourLetterWordMain@85] - connecting
to 127.0.0.1 11466
    [junit] 2016-10-26 11:55:28,061 [myid:] - INFO  [main:JMXEnv@146] - ensureOnly:[]
    [junit] 2016-10-26 11:55:28,064 [myid:] - INFO  [main:ClientBase@568] - fdcount after
test is: 1373 at start it was 1373
    [junit] 2016-10-26 11:55:28,064 [myid:] - INFO  [main:ZKTestCase$1@65] - SUCCEEDED testWatcherAutoResetWithLocal
    [junit] 2016-10-26 11:55:28,064 [myid:] - INFO  [main:ZKTestCase$1@60] - FINISHED testWatcherAutoResetWithLocal
    [junit] Tests run: 101, Failures: 0, Errors: 0, Skipped: 0, Time elapsed: 436.719 sec,
Thread: 1, Class: org.apache.zookeeper.test.NioNettySuiteTest
    [junit] Running org.apache.zookeeper.server.quorum.Zab1_0Test in thread 3
    [junit] Tests run: 1, Failures: 0, Errors: 1, Skipped: 0, Time elapsed: 0 sec, Thread:
3, Class: org.apache.zookeeper.server.quorum.Zab1_0Test
    [junit] Test org.apache.zookeeper.server.quorum.Zab1_0Test FAILED (timeout)

BUILD FAILED
/home/jenkins/jenkins-slave/workspace/ZooKeeper-trunk-jdk8/build.xml:1207: Tests failed!

Total time: 16 minutes 23 seconds
Build step 'Invoke Ant' marked build as failure
[WARNINGS] Skipping publisher since build result is FAILURE
Recording test results
Email was triggered for: Failure - Any
Sending email for trigger: Failure - Any



###################################################################################
############################## FAILED TESTS (if any) ##############################
2 tests failed.
FAILED:  org.apache.zookeeper.server.quorum.ReconfigRecoveryTest.testCurrentServersAreObserversInNextConfig

Error Message:
waiting for server 3 being up

Stack Trace:
junit.framework.AssertionFailedError: waiting for server 3 being up
	at org.apache.zookeeper.server.quorum.ReconfigRecoveryTest.testCurrentServersAreObserversInNextConfig(ReconfigRecoveryTest.java:217)
	at org.apache.zookeeper.JUnit4ZKTestRunner$LoggedInvokeMethod.evaluate(JUnit4ZKTestRunner.java:79)


FAILED:  org.apache.zookeeper.server.quorum.Zab1_0Test.testNormalObserverRun

Error Message:
Timeout occurred. Please note the time in the report does not reflect the time until the timeout.

Stack Trace:
junit.framework.AssertionFailedError: Timeout occurred. Please note the time in the report
does not reflect the time until the timeout.
	at java.lang.Thread.run(Thread.java:745)



Mime
  • Unnamed multipart/mixed (inline, None, 0 bytes)
View raw message