zookeeper-dev mailing list archives

Site index · List index
Message view « Date » · « Thread »
Top « Date » · « Thread »
From Apache Jenkins Server <jenk...@builds.apache.org>
Subject ZooKeeper_branch35_solaris - Build # 282 - Still Failing
Date Thu, 13 Oct 2016 16:17:30 GMT
See https://builds.apache.org/job/ZooKeeper_branch35_solaris/282/

###################################################################################
########################## LAST 60 LINES OF THE CONSOLE ###########################
[...truncated 6761 lines...]
    [junit] 2016-10-13 16:18:12,261 [myid:] - INFO  [SessionTracker:SessionTrackerImpl@158]
- SessionTrackerImpl exited loop!
    [junit] 2016-10-13 16:18:12,261 [myid:] - INFO  [SessionTracker:SessionTrackerImpl@158]
- SessionTrackerImpl exited loop!
    [junit] 2016-10-13 16:18:12,261 [myid:] - INFO  [SessionTracker:SessionTrackerImpl@158]
- SessionTrackerImpl exited loop!
    [junit] 2016-10-13 16:18:12,261 [myid:] - INFO  [SessionTracker:SessionTrackerImpl@158]
- SessionTrackerImpl exited loop!
    [junit] 2016-10-13 16:18:12,522 [myid:] - INFO  [main:FourLetterWordMain@85] - connecting
to 127.0.0.1 11267
    [junit] 2016-10-13 16:18:12,524 [myid:] - INFO  [main:JMXEnv@146] - ensureOnly:[]
    [junit] 2016-10-13 16:18:12,533 [myid:] - INFO  [main:ClientBase@568] - fdcount after
test is: 97 at start it was 101
    [junit] 2016-10-13 16:18:12,533 [myid:] - INFO  [main:ZKTestCase$1@65] - SUCCEEDED testRemoveAllWatchesOnAPath
    [junit] 2016-10-13 16:18:12,533 [myid:] - INFO  [main:ZKTestCase$1@60] - FINISHED testRemoveAllWatchesOnAPath
    [junit] Tests run: 46, Failures: 0, Errors: 0, Time elapsed: 76.929 sec
    [junit] 2016-10-13 16:18:12,911 [myid:127.0.0.1:11232] - INFO  [Time-limited test-SendThread(127.0.0.1:11232):ClientCnxn$SendThread@1113]
- Opening socket connection to server 127.0.0.1/127.0.0.1:11232. Will not attempt to authenticate
using SASL (unknown error)
    [junit] 2016-10-13 16:18:12,911 [myid:127.0.0.1:11232] - ERROR [Time-limited test-SendThread(127.0.0.1:11232):ClientCnxnSocketNIO@287]
- Unable to open socket to 127.0.0.1/127.0.0.1:11232
    [junit] 2016-10-13 16:18:12,912 [myid:127.0.0.1:11232] - WARN  [Time-limited test-SendThread(127.0.0.1:11232):ClientCnxn$SendThread@1235]
- Session 0x1243bd07f300002 for server null, unexpected error, closing socket connection and
attempting reconnect
    [junit] java.net.ConnectException: Connection refused
    [junit] 	at sun.nio.ch.Net.connect0(Native Method)
    [junit] 	at sun.nio.ch.Net.connect(Net.java:465)
    [junit] 	at sun.nio.ch.Net.connect(Net.java:457)
    [junit] 	at sun.nio.ch.SocketChannelImpl.connect(SocketChannelImpl.java:670)
    [junit] 	at org.apache.zookeeper.ClientCnxnSocketNIO.registerAndConnect(ClientCnxnSocketNIO.java:275)
    [junit] 	at org.apache.zookeeper.ClientCnxnSocketNIO.connect(ClientCnxnSocketNIO.java:285)
    [junit] 	at org.apache.zookeeper.ClientCnxn$SendThread.startConnect(ClientCnxn.java:1098)
    [junit] 	at org.apache.zookeeper.ClientCnxn$SendThread.run(ClientCnxn.java:1133)
    [junit] 2016-10-13 16:18:12,931 [myid:127.0.0.1:11255] - INFO  [Time-limited test-SendThread(127.0.0.1:11255):ClientCnxn$SendThread@1113]
- Opening socket connection to server 127.0.0.1/127.0.0.1:11255. Will not attempt to authenticate
using SASL (unknown error)
    [junit] 2016-10-13 16:18:12,931 [myid:127.0.0.1:11255] - ERROR [Time-limited test-SendThread(127.0.0.1:11255):ClientCnxnSocketNIO@287]
- Unable to open socket to 127.0.0.1/127.0.0.1:11255
    [junit] 2016-10-13 16:18:12,931 [myid:127.0.0.1:11255] - WARN  [Time-limited test-SendThread(127.0.0.1:11255):ClientCnxn$SendThread@1235]
- Session 0x1243bd0f7ad0002 for server null, unexpected error, closing socket connection and
attempting reconnect
    [junit] java.net.ConnectException: Connection refused
    [junit] 	at sun.nio.ch.Net.connect0(Native Method)
    [junit] 	at sun.nio.ch.Net.connect(Net.java:465)
    [junit] 	at sun.nio.ch.Net.connect(Net.java:457)
    [junit] 	at sun.nio.ch.SocketChannelImpl.connect(SocketChannelImpl.java:670)
    [junit] 	at org.apache.zookeeper.ClientCnxnSocketNIO.registerAndConnect(ClientCnxnSocketNIO.java:275)
    [junit] 	at org.apache.zookeeper.ClientCnxnSocketNIO.connect(ClientCnxnSocketNIO.java:285)
    [junit] 	at org.apache.zookeeper.ClientCnxn$SendThread.startConnect(ClientCnxn.java:1098)
    [junit] 	at org.apache.zookeeper.ClientCnxn$SendThread.run(ClientCnxn.java:1133)
    [junit] 2016-10-13 16:18:14,216 [myid:127.0.0.1:11232] - INFO  [Time-limited test-SendThread(127.0.0.1:11232):ClientCnxn$SendThread@1113]
- Opening socket connection to server 127.0.0.1/127.0.0.1:11232. Will not attempt to authenticate
using SASL (unknown error)
    [junit] 2016-10-13 16:18:14,222 [myid:127.0.0.1:11232] - ERROR [Time-limited test-SendThread(127.0.0.1:11232):ClientCnxnSocketNIO@287]
- Unable to open socket to 127.0.0.1/127.0.0.1:11232
    [junit] 2016-10-13 16:18:14,222 [myid:127.0.0.1:11232] - WARN  [Time-limited test-SendThread(127.0.0.1:11232):ClientCnxn$SendThread@1235]
- Session 0x1243bd07f300002 for server null, unexpected error, closing socket connection and
attempting reconnect
    [junit] java.net.ConnectException: Connection refused
    [junit] 	at sun.nio.ch.Net.connect0(Native Method)
    [junit] 	at sun.nio.ch.Net.connect(Net.java:465)
    [junit] 	at sun.nio.ch.Net.connect(Net.java:457)
    [junit] 	at sun.nio.ch.SocketChannelImpl.connect(SocketChannelImpl.java:670)
    [junit] 	at org.apache.zookeeper.ClientCnxnSocketNIO.registerAndConnect(ClientCnxnSocketNIO.java:275)
    [junit] 	at org.apache.zookeeper.ClientCnxnSocketNIO.connect(ClientCnxnSocketNIO.java:285)
    [junit] 	at org.apache.zookeeper.ClientCnxn$SendThread.startConnect(ClientCnxn.java:1098)
    [junit] 	at org.apache.zookeeper.ClientCnxn$SendThread.run(ClientCnxn.java:1133)
    [junit] Running org.apache.zookeeper.VerGenTest
    [junit] Tests run: 1, Failures: 0, Errors: 1, Time elapsed: 0 sec

BUILD FAILED
/zonestorage/hudson_solaris/home/hudson/hudson-slave/workspace/ZooKeeper_branch35_solaris/build.xml:1219:
Process fork failed.

Total time: 6 minutes 46 seconds
Build step 'Invoke Ant' marked build as failure
[locks-and-latches] Releasing all the locks
[locks-and-latches] All the locks released
Recording test results
Email was triggered for: Failure - Any
Sending email for trigger: Failure - Any



###################################################################################
############################## FAILED TESTS (if any) ##############################
1 tests failed.
FAILED:  org.apache.zookeeper.VerGenTest.unknown

Error Message:
Forked Java VM exited abnormally. Please note the time in the report does not reflect the
time until the VM exit.

Stack Trace:
junit.framework.AssertionFailedError: Forked Java VM exited abnormally. Please note the time
in the report does not reflect the time until the VM exit.



Mime
  • Unnamed multipart/mixed (inline, None, 0 bytes)
View raw message