zookeeper-dev mailing list archives

Site index · List index
Message view « Date » · « Thread »
Top « Date » · « Thread »
From Apache Jenkins Server <jenk...@builds.apache.org>
Subject ZooKeeper_branch34_solaris - Build # 1341 - Failure
Date Sat, 29 Oct 2016 13:34:29 GMT
See https://builds.apache.org/job/ZooKeeper_branch34_solaris/1341/

###################################################################################
########################## LAST 60 LINES OF THE CONSOLE ###########################
[...truncated 3315 lines...]
    [junit] 2016-10-29 13:35:01,077 [myid:] - ERROR [main:ZooKeeperServer@472] - ZKShutdownHandler
is not registered, so ZooKeeper server won't take any action on ERROR or SHUTDOWN server state
changes
    [junit] 2016-10-29 13:35:01,077 [myid:] - INFO  [main:FourLetterWordMain@62] - connecting
to 127.0.0.1 11229
    [junit] 2016-10-29 13:35:01,078 [myid:] - INFO  [New I/O worker #18:NettyServerCnxn@632]
- Processing stat command from /127.0.0.1:60959
    [junit] 2016-10-29 13:35:01,078 [myid:] - INFO  [New I/O worker #18:NettyServerCnxn$StatCommand@469]
- Stat command output
    [junit] 2016-10-29 13:35:01,079 [myid:] - INFO  [main:NettyServerCnxnFactory@342] - shutdown
called 0.0.0.0/0.0.0.0:11228
    [junit] 2016-10-29 13:35:01,199 [myid:] - INFO  [main:ZooKeeperServer@497] - shutting
down
    [junit] 2016-10-29 13:35:01,200 [myid:] - ERROR [main:ZooKeeperServer@472] - ZKShutdownHandler
is not registered, so ZooKeeper server won't take any action on ERROR or SHUTDOWN server state
changes
    [junit] 2016-10-29 13:35:01,200 [myid:] - INFO  [main:SessionTrackerImpl@225] - Shutting
down
    [junit] 2016-10-29 13:35:01,200 [myid:] - INFO  [main:PrepRequestProcessor@765] - Shutting
down
    [junit] 2016-10-29 13:35:01,200 [myid:] - INFO  [main:SyncRequestProcessor@208] - Shutting
down
    [junit] 2016-10-29 13:35:01,200 [myid:] - INFO  [ProcessThread(sid:0 cport:11228)::PrepRequestProcessor@143]
- PrepRequestProcessor exited loop!
    [junit] 2016-10-29 13:35:01,200 [myid:] - INFO  [SyncThread:0:SyncRequestProcessor@186]
- SyncRequestProcessor exited!
    [junit] 2016-10-29 13:35:01,201 [myid:] - INFO  [main:FinalRequestProcessor@402] - shutdown
of request processor complete
    [junit] 2016-10-29 13:35:01,201 [myid:] - INFO  [main:NettyServerCnxnFactory@342] - shutdown
called 0.0.0.0/0.0.0.0:11229
    [junit] 2016-10-29 13:35:01,203 [myid:] - INFO  [main:ZooKeeperServer@497] - shutting
down
    [junit] 2016-10-29 13:35:01,203 [myid:] - ERROR [main:ZooKeeperServer@472] - ZKShutdownHandler
is not registered, so ZooKeeper server won't take any action on ERROR or SHUTDOWN server state
changes
    [junit] 2016-10-29 13:35:01,203 [myid:] - INFO  [main:SessionTrackerImpl@225] - Shutting
down
    [junit] 2016-10-29 13:35:01,203 [myid:] - INFO  [main:PrepRequestProcessor@765] - Shutting
down
    [junit] 2016-10-29 13:35:01,203 [myid:] - INFO  [main:SyncRequestProcessor@208] - Shutting
down
    [junit] 2016-10-29 13:35:01,203 [myid:] - INFO  [ProcessThread(sid:0 cport:11229)::PrepRequestProcessor@143]
- PrepRequestProcessor exited loop!
    [junit] 2016-10-29 13:35:01,204 [myid:] - INFO  [SyncThread:0:SyncRequestProcessor@186]
- SyncRequestProcessor exited!
    [junit] 2016-10-29 13:35:01,204 [myid:] - INFO  [main:FinalRequestProcessor@402] - shutdown
of request processor complete
    [junit] 2016-10-29 13:35:01,254 [myid:] - INFO  [main:JUnit4ZKTestRunner$LoggedInvokeMethod@58]
- Memory used 3471
    [junit] 2016-10-29 13:35:01,255 [myid:] - INFO  [main:JUnit4ZKTestRunner$LoggedInvokeMethod@63]
- Number of threads 28
    [junit] 2016-10-29 13:35:01,255 [myid:] - INFO  [main:JUnit4ZKTestRunner$LoggedInvokeMethod@78]
- FINISHED TEST METHOD testJMXRegistrationWithNetty
    [junit] 2016-10-29 13:35:01,255 [myid:] - INFO  [main:ZKTestCase$1@65] - SUCCEEDED testJMXRegistrationWithNetty
    [junit] 2016-10-29 13:35:01,255 [myid:] - INFO  [main:ZKTestCase$1@60] - FINISHED testJMXRegistrationWithNetty
    [junit] 2016-10-29 13:35:01,256 [myid:] - INFO  [main:ZKTestCase$1@55] - STARTING testRaceBetweenSyncFlushAndZKShutdown
    [junit] 2016-10-29 13:35:01,256 [myid:] - INFO  [Thread-12:JUnit4ZKTestRunner$LoggedInvokeMethod@53]
- RUNNING TEST METHOD testRaceBetweenSyncFlushAndZKShutdown
    [junit] 2016-10-29 13:35:01,286 [myid:] - INFO  [Thread-12:ZooKeeperServer@173] - Created
server with tickTime 2000 minSessionTimeout 2000 maxSessionTimeout 4000 datadir /zonestorage/hudson_solaris/home/hudson/hudson-slave/workspace/ZooKeeper_branch34_solaris/build/test/tmp/test1485470771930401980.junit.dir/test1824368906567099954.dir/version-2
snapdir /zonestorage/hudson_solaris/home/hudson/hudson-slave/workspace/ZooKeeper_branch34_solaris/build/test/tmp/test1485470771930401980.junit.dir/test1824368906567099954.dir/version-2
    [junit] 2016-10-29 13:35:01,395 [myid:] - INFO  [SyncThread:0:FileTxnLog@203] - Creating
new log file: log.300000007
    [junit] 2016-10-29 13:35:01,396 [myid:] - ERROR [Thread-12:ZooKeeperServer@472] - ZKShutdownHandler
is not registered, so ZooKeeper server won't take any action on ERROR or SHUTDOWN server state
changes
    [junit] 2016-10-29 13:35:01,398 [myid:] - INFO  [Thread-13:ZooKeeperServer@497] - shutting
down
    [junit] 2016-10-29 13:35:01,398 [myid:] - ERROR [Thread-13:ZooKeeperServer@472] - ZKShutdownHandler
is not registered, so ZooKeeper server won't take any action on ERROR or SHUTDOWN server state
changes
    [junit] 2016-10-29 13:35:01,398 [myid:] - INFO  [Thread-13:SessionTrackerImpl@225] - Shutting
down
    [junit] 2016-10-29 13:35:01,398 [myid:] - INFO  [Thread-13:PrepRequestProcessor@765] -
Shutting down
    [junit] 2016-10-29 13:35:01,398 [myid:] - INFO  [Thread-13:SyncRequestProcessor@208] -
Shutting down
    [junit] 2016-10-29 13:35:01,398 [myid:] - INFO  [ProcessThread(sid:0 cport:-1)::PrepRequestProcessor@143]
- PrepRequestProcessor exited loop!
    [junit] 2016-10-29 13:35:01,411 [myid:] - INFO  [SyncThread:0:SyncRequestProcessor@186]
- SyncRequestProcessor exited!
    [junit] 2016-10-29 13:35:01,411 [myid:] - INFO  [Thread-13:FinalRequestProcessor@402]
- shutdown of request processor complete
    [junit] 2016-10-29 13:35:01,411 [myid:] - INFO  [Thread-12:JUnit4ZKTestRunner$LoggedInvokeMethod@58]
- Memory used 5929
    [junit] 2016-10-29 13:35:01,411 [myid:] - INFO  [Thread-12:JUnit4ZKTestRunner$LoggedInvokeMethod@63]
- Number of threads 25
    [junit] 2016-10-29 13:35:01,411 [myid:] - INFO  [Thread-12:JUnit4ZKTestRunner$LoggedInvokeMethod@78]
- FINISHED TEST METHOD testRaceBetweenSyncFlushAndZKShutdown
    [junit] 2016-10-29 13:35:01,412 [myid:] - INFO  [main:ZKTestCase$1@65] - SUCCEEDED testRaceBetweenSyncFlushAndZKShutdown
    [junit] 2016-10-29 13:35:01,412 [myid:] - INFO  [main:ZKTestCase$1@60] - FINISHED testRaceBetweenSyncFlushAndZKShutdown
    [junit] Tests run: 8, Failures: 0, Errors: 0, Time elapsed: 44.583 sec
    [junit] Running org.apache.zookeeper.server.ZooKeeperServerTest
    [junit] Tests run: 1, Failures: 0, Errors: 1, Time elapsed: 0 sec

BUILD FAILED
/zonestorage/hudson_solaris/home/hudson/hudson-slave/workspace/ZooKeeper_branch34_solaris/build.xml:1289:
Process fork failed.

Total time: 7 minutes 25 seconds
Build step 'Invoke Ant' marked build as failure
[locks-and-latches] Releasing all the locks
[locks-and-latches] All the locks released
Recording test results
Email was triggered for: Failure - Any
Sending email for trigger: Failure - Any



###################################################################################
############################## FAILED TESTS (if any) ##############################
1 tests failed.
FAILED:  org.apache.zookeeper.server.ZooKeeperServerTest.unknown

Error Message:
Forked Java VM exited abnormally. Please note the time in the report does not reflect the
time until the VM exit.

Stack Trace:
junit.framework.AssertionFailedError: Forked Java VM exited abnormally. Please note the time
in the report does not reflect the time until the VM exit.



Mime
  • Unnamed multipart/mixed (inline, None, 0 bytes)
View raw message