zookeeper-dev mailing list archives

Site index · List index
Message view « Date » · « Thread »
Top « Date » · « Thread »
From Apache Jenkins Server <jenk...@builds.apache.org>
Subject ZooKeeper-trunk - Build # 3111 - Still Failing
Date Sat, 08 Oct 2016 17:55:56 GMT
See https://builds.apache.org/job/ZooKeeper-trunk/3111/

###################################################################################
########################## LAST 60 LINES OF THE CONSOLE ###########################
[...truncated 459558 lines...]
    [junit] 	at org.jboss.netty.util.internal.DeadLockProofWorker$1.run(DeadLockProofWorker.java:42)
    [junit] 	at java.util.concurrent.ThreadPoolExecutor.runWorker(ThreadPoolExecutor.java:1145)
    [junit] 	at java.util.concurrent.ThreadPoolExecutor$Worker.run(ThreadPoolExecutor.java:615)
    [junit] 	at java.lang.Thread.run(Thread.java:745)
    [junit] 2016-10-08 17:55:31,770 [myid:] - INFO  [SyncThread:0:MBeanRegistry@128] - Unregister
MBean [org.apache.ZooKeeperService:name0=StandaloneServer_port24931,name1=Connections,name2=127.0.0.1,name3=0x10035e0c1750000]
    [junit] 2016-10-08 17:55:31,855 [myid:127.0.0.1:24814] - INFO  [main-SendThread(127.0.0.1:24814):ClientCnxn$SendThread@1113]
- Opening socket connection to server 127.0.0.1/127.0.0.1:24814. Will not attempt to authenticate
using SASL (unknown error)
    [junit] 2016-10-08 17:55:31,856 [myid:127.0.0.1:24814] - WARN  [main-SendThread(127.0.0.1:24814):ClientCnxn$SendThread@1235]
- Session 0x30035ddcb820000 for server 127.0.0.1/127.0.0.1:24814, unexpected error, closing
socket connection and attempting reconnect
    [junit] java.net.ConnectException: Connection refused
    [junit] 	at sun.nio.ch.SocketChannelImpl.checkConnect(Native Method)
    [junit] 	at sun.nio.ch.SocketChannelImpl.finishConnect(SocketChannelImpl.java:744)
    [junit] 	at org.apache.zookeeper.ClientCnxnSocketNIO.doTransport(ClientCnxnSocketNIO.java:357)
    [junit] 	at org.apache.zookeeper.ClientCnxn$SendThread.run(ClientCnxn.java:1214)
    [junit] 2016-10-08 17:55:31,871 [myid:] - INFO  [main:ZooKeeper@1315] - Session: 0x10035e0c1750000
closed
    [junit] 2016-10-08 17:55:31,871 [myid:] - INFO  [main-EventThread:ClientCnxn$EventThread@513]
- EventThread shut down for session: 0x10035e0c1750000
    [junit] 2016-10-08 17:55:31,871 [myid:] - INFO  [main:JUnit4ZKTestRunner$LoggedInvokeMethod@82]
- Memory used 148119
    [junit] 2016-10-08 17:55:31,871 [myid:] - INFO  [main:JUnit4ZKTestRunner$LoggedInvokeMethod@87]
- Number of threads 1642
    [junit] 2016-10-08 17:55:31,871 [myid:] - INFO  [main:JUnit4ZKTestRunner$LoggedInvokeMethod@102]
- FINISHED TEST METHOD testWatcherAutoResetWithLocal
    [junit] 2016-10-08 17:55:31,871 [myid:] - INFO  [main:ClientBase@543] - tearDown starting
    [junit] 2016-10-08 17:55:31,871 [myid:] - INFO  [main:ClientBase@513] - STOPPING server
    [junit] 2016-10-08 17:55:31,871 [myid:] - INFO  [main:NettyServerCnxnFactory@464] - shutdown
called 0.0.0.0/0.0.0.0:24931
    [junit] 2016-10-08 17:55:31,877 [myid:] - INFO  [main:ZooKeeperServer@529] - shutting
down
    [junit] 2016-10-08 17:55:31,877 [myid:] - ERROR [main:ZooKeeperServer@501] - ZKShutdownHandler
is not registered, so ZooKeeper server won't take any action on ERROR or SHUTDOWN server state
changes
    [junit] 2016-10-08 17:55:31,877 [myid:] - INFO  [main:SessionTrackerImpl@232] - Shutting
down
    [junit] 2016-10-08 17:55:31,878 [myid:] - INFO  [main:PrepRequestProcessor@996] - Shutting
down
    [junit] 2016-10-08 17:55:31,878 [myid:] - INFO  [main:SyncRequestProcessor@191] - Shutting
down
    [junit] 2016-10-08 17:55:31,878 [myid:] - INFO  [ProcessThread(sid:0 cport:24931)::PrepRequestProcessor@156]
- PrepRequestProcessor exited loop!
    [junit] 2016-10-08 17:55:31,878 [myid:] - INFO  [SyncThread:0:SyncRequestProcessor@169]
- SyncRequestProcessor exited!
    [junit] 2016-10-08 17:55:31,878 [myid:] - INFO  [main:FinalRequestProcessor@481] - shutdown
of request processor complete
    [junit] 2016-10-08 17:55:31,879 [myid:] - INFO  [main:MBeanRegistry@128] - Unregister
MBean [org.apache.ZooKeeperService:name0=StandaloneServer_port24931,name1=InMemoryDataTree]
    [junit] 2016-10-08 17:55:31,879 [myid:] - INFO  [main:MBeanRegistry@128] - Unregister
MBean [org.apache.ZooKeeperService:name0=StandaloneServer_port24931]
    [junit] 2016-10-08 17:55:31,879 [myid:] - INFO  [main:FourLetterWordMain@85] - connecting
to 127.0.0.1 24931
    [junit] 2016-10-08 17:55:31,879 [myid:] - INFO  [main:JMXEnv@146] - ensureOnly:[]
    [junit] 2016-10-08 17:55:31,885 [myid:] - INFO  [main:ClientBase@568] - fdcount after
test is: 4822 at start it was 4822
    [junit] 2016-10-08 17:55:31,885 [myid:] - INFO  [main:ZKTestCase$1@65] - SUCCEEDED testWatcherAutoResetWithLocal
    [junit] 2016-10-08 17:55:31,885 [myid:] - INFO  [main:ZKTestCase$1@60] - FINISHED testWatcherAutoResetWithLocal
    [junit] Tests run: 101, Failures: 0, Errors: 0, Skipped: 0, Time elapsed: 510.417 sec,
Thread: 6, Class: org.apache.zookeeper.test.NioNettySuiteTest

BUILD FAILED
/home/jenkins/jenkins-slave/workspace/ZooKeeper-trunk/build.xml:1322: The following error
occurred while executing this line:
/home/jenkins/jenkins-slave/workspace/ZooKeeper-trunk/build.xml:1207: Tests failed!

Total time: 12 minutes 48 seconds
Build step 'Execute shell' marked build as failure
[FINDBUGS] Skipping publisher since build result is FAILURE
[WARNINGS] Skipping publisher since build result is FAILURE
Archiving artifacts
Setting JDK_1_7_LATEST__HOME=/home/jenkins/tools/java/latest1.7
Recording fingerprints
Setting JDK_1_7_LATEST__HOME=/home/jenkins/tools/java/latest1.7
Updating ZOOKEEPER-2169
Recording test results
Setting JDK_1_7_LATEST__HOME=/home/jenkins/tools/java/latest1.7
Publishing Javadoc
Setting JDK_1_7_LATEST__HOME=/home/jenkins/tools/java/latest1.7
Setting JDK_1_7_LATEST__HOME=/home/jenkins/tools/java/latest1.7
Email was triggered for: Failure - Any
Sending email for trigger: Failure - Any
Setting JDK_1_7_LATEST__HOME=/home/jenkins/tools/java/latest1.7
Setting JDK_1_7_LATEST__HOME=/home/jenkins/tools/java/latest1.7



###################################################################################
############################## FAILED TESTS (if any) ##############################
1 tests failed.
FAILED:  org.apache.zookeeper.server.quorum.ReconfigDuringLeaderSyncTest.testDuringLeaderSync

Error Message:
zoo.cfg.dynamic.next is not deleted.

Stack Trace:
junit.framework.AssertionFailedError: zoo.cfg.dynamic.next is not deleted.
	at org.apache.zookeeper.server.quorum.ReconfigDuringLeaderSyncTest.testDuringLeaderSync(ReconfigDuringLeaderSyncTest.java:155)
	at org.apache.zookeeper.JUnit4ZKTestRunner$LoggedInvokeMethod.evaluate(JUnit4ZKTestRunner.java:79)



Mime
  • Unnamed multipart/mixed (inline, None, 0 bytes)
View raw message