zookeeper-dev mailing list archives

Site index · List index
Message view « Date » · « Thread »
Top « Date » · « Thread »
From Apache Jenkins Server <jenk...@builds.apache.org>
Subject ZooKeeper-trunk-solaris - Build # 1280 - Still Failing
Date Tue, 23 Aug 2016 23:49:38 GMT
See https://builds.apache.org/job/ZooKeeper-trunk-solaris/1280/

###################################################################################
########################## LAST 60 LINES OF THE CONSOLE ###########################
[...truncated 99809 lines...]
    [junit] java.net.ConnectException: Connection refused
    [junit] 	at java.net.PlainSocketImpl.socketConnect(Native Method)
    [junit] 	at java.net.AbstractPlainSocketImpl.doConnect(AbstractPlainSocketImpl.java:339)
    [junit] 	at java.net.AbstractPlainSocketImpl.connectToAddress(AbstractPlainSocketImpl.java:200)
    [junit] 	at java.net.AbstractPlainSocketImpl.connect(AbstractPlainSocketImpl.java:182)
    [junit] 	at java.net.SocksSocketImpl.connect(SocksSocketImpl.java:392)
    [junit] 	at java.net.Socket.connect(Socket.java:579)
    [junit] 	at org.apache.zookeeper.server.quorum.Learner.sockConnect(Learner.java:227)
    [junit] 	at org.apache.zookeeper.server.quorum.Learner.connectToLeader(Learner.java:256)
    [junit] 	at org.apache.zookeeper.server.quorum.Observer.observeLeader(Observer.java:69)
    [junit] 	at org.apache.zookeeper.server.quorum.QuorumPeer.run(QuorumPeer.java:1098)
    [junit] 2016-08-23 23:50:26,331 [myid:1] - WARN  [QuorumPeer[myid=1](plain=/127.0.0.1:11285)(secure=disabled):Observer@81]
- Exception when observing the leader
    [junit] java.net.ConnectException: Connection refused
    [junit] 	at java.net.PlainSocketImpl.socketConnect(Native Method)
    [junit] 	at java.net.AbstractPlainSocketImpl.doConnect(AbstractPlainSocketImpl.java:339)
    [junit] 	at java.net.AbstractPlainSocketImpl.connectToAddress(AbstractPlainSocketImpl.java:200)
    [junit] 	at java.net.AbstractPlainSocketImpl.connect(AbstractPlainSocketImpl.java:182)
    [junit] 	at java.net.SocksSocketImpl.connect(SocksSocketImpl.java:392)
    [junit] 	at java.net.Socket.connect(Socket.java:579)
    [junit] 	at org.apache.zookeeper.server.quorum.Learner.sockConnect(Learner.java:227)
    [junit] 	at org.apache.zookeeper.server.quorum.Learner.connectToLeader(Learner.java:256)
    [junit] 	at org.apache.zookeeper.server.quorum.Observer.observeLeader(Observer.java:69)
    [junit] 	at org.apache.zookeeper.server.quorum.QuorumPeer.run(QuorumPeer.java:1098)
    [junit] 2016-08-23 23:50:26,331 [myid:1] - INFO  [QuorumPeer[myid=1](plain=/127.0.0.1:11285)(secure=disabled):MBeanRegistry@128]
- Unregister MBean [org.apache.ZooKeeperService:name0=ReplicatedServer_id1,name1=replica.1,name2=Observer]
    [junit] 2016-08-23 23:50:26,332 [myid:1] - INFO  [QuorumPeer[myid=1](plain=/127.0.0.1:11285)(secure=disabled):Observer@162]
- shutdown called
    [junit] java.lang.Exception: shutdown Observer
    [junit] 	at org.apache.zookeeper.server.quorum.Observer.shutdown(Observer.java:162)
    [junit] 	at org.apache.zookeeper.server.quorum.QuorumPeer.run(QuorumPeer.java:1102)
    [junit] 2016-08-23 23:50:26,332 [myid:1] - INFO  [QuorumPeer[myid=1](plain=/127.0.0.1:11285)(secure=disabled):NIOServerCnxn@607]
- Closed socket connection for client /127.0.0.1:48984 (no session established for client)
    [junit] 2016-08-23 23:50:26,332 [myid:1] - WARN  [QuorumPeer[myid=1](plain=/127.0.0.1:11285)(secure=disabled):QuorumPeer@1158]
- PeerState set to LOOKING
    [junit] 2016-08-23 23:50:26,332 [myid:1] - INFO  [QuorumPeer[myid=1](plain=/127.0.0.1:11285)(secure=disabled):QuorumPeer@1033]
- LOOKING
    [junit] 2016-08-23 23:50:26,332 [myid:1] - INFO  [QuorumPeer[myid=1](plain=/127.0.0.1:11285)(secure=disabled):FastLeaderElection@894]
- New election. My id =  1, proposed zxid=0x8000000000000000
    [junit] 2016-08-23 23:50:26,491 [myid:127.0.0.1:11285] - INFO  [main-SendThread(127.0.0.1:11285):ClientCnxn$SendThread@1113]
- Opening socket connection to server 127.0.0.1/127.0.0.1:11285. Will not attempt to authenticate
using SASL (unknown error)
    [junit] 2016-08-23 23:50:26,491 [myid:127.0.0.1:11285] - INFO  [main-SendThread(127.0.0.1:11285):ClientCnxn$SendThread@948]
- Socket connection established, initiating session, client: null, server: null
    [junit] 2016-08-23 23:50:26,492 [myid:1] - INFO  [NIOServerCxnFactory.AcceptThread:localhost/127.0.0.1:11285:NIOServerCnxnFactory$AcceptThread@296]
- Accepted socket connection from /127.0.0.1:48986
    [junit] 2016-08-23 23:50:26,591 [myid:] - INFO  [main:FourLetterWordMain@85] - connecting
to 127.0.0.1 11285
    [junit] 2016-08-23 23:50:26,592 [myid:1] - INFO  [NIOServerCxnFactory.AcceptThread:localhost/127.0.0.1:11285:NIOServerCnxnFactory$AcceptThread@296]
- Accepted socket connection from /127.0.0.1:48987
    [junit] #
    [junit] # There is insufficient memory for the Java Runtime Environment to continue.
    [junit] # Out of swap space to map in thread stack.
    [junit] # An error report file with more information is saved as:
    [junit] # /zonestorage/hudson_solaris/home/hudson/hudson-slave/workspace/ZooKeeper-trunk-solaris/trunk/build/test/hs_err_pid21298.log[thread
775 also had an error]
    [junit] 
    [junit] Running org.apache.zookeeper.server.quorum.ReconfigRecoveryTest
    [junit] Tests run: 1, Failures: 0, Errors: 1, Time elapsed: 0 sec
    [junit] Test org.apache.zookeeper.server.quorum.ReconfigRecoveryTest FAILED (crashed)
    [junit] Running org.apache.zookeeper.server.quorum.RemotePeerBeanTest
    [junit] Tests run: 1, Failures: 0, Errors: 1, Time elapsed: 0 sec

BUILD FAILED
/zonestorage/hudson_solaris/home/hudson/hudson-slave/workspace/ZooKeeper-trunk-solaris/trunk/build.xml:1219:
Process fork failed.

Total time: 33 minutes 21 seconds
Build step 'Invoke Ant' marked build as failure
[locks-and-latches] Releasing all the locks
[locks-and-latches] All the locks released
Recording test results
Email was triggered for: Failure - Any
Sending email for trigger: Failure - Any



###################################################################################
############################## FAILED TESTS (if any) ##############################
2 tests failed.
FAILED:  org.apache.zookeeper.server.quorum.ReconfigRecoveryTest.testCurrentServersAreObserversInNextConfig

Error Message:
Forked Java VM exited abnormally. Please note the time in the report does not reflect the
time until the VM exit.

Stack Trace:
junit.framework.AssertionFailedError: Forked Java VM exited abnormally. Please note the time
in the report does not reflect the time until the VM exit.


FAILED:  org.apache.zookeeper.server.quorum.RemotePeerBeanTest.unknown

Error Message:
Forked Java VM exited abnormally. Please note the time in the report does not reflect the
time until the VM exit.

Stack Trace:
junit.framework.AssertionFailedError: Forked Java VM exited abnormally. Please note the time
in the report does not reflect the time until the VM exit.



Mime
  • Unnamed multipart/mixed (inline, None, 0 bytes)
View raw message