zookeeper-dev mailing list archives

Site index · List index
Message view « Date » · « Thread »
Top « Date » · « Thread »
From Apache Jenkins Server <jenk...@builds.apache.org>
Subject ZooKeeper-trunk-solaris - Build # 1275 - Still Failing
Date Fri, 19 Aug 2016 07:51:35 GMT
See https://builds.apache.org/job/ZooKeeper-trunk-solaris/1275/

###################################################################################
########################## LAST 60 LINES OF THE CONSOLE ###########################
[...truncated 108927 lines...]
    [junit] 	at org.apache.zookeeper.server.quorum.LearnerHandler.run(LearnerHandler.java:622)
    [junit] 2016-08-19 07:51:44,037 [myid:] - INFO  [Thread-18:MBeanRegistry@128] - Unregister
MBean [org.apache.ZooKeeperService:name0=Leader]
    [junit] 2016-08-19 07:51:44,037 [myid:] - INFO  [Thread-18:Zab1_0Test$LeadThread@97] -
Leader thread interrupted
    [junit] java.lang.InterruptedException
    [junit] 	at java.lang.Object.wait(Native Method)
    [junit] 	at org.apache.zookeeper.server.quorum.Leader.lead(Leader.java:561)
    [junit] 	at org.apache.zookeeper.server.quorum.Zab1_0Test$LeadThread.run(Zab1_0Test.java:95)
    [junit] 2016-08-19 07:51:44,037 [myid:] - INFO  [Thread-18:Leader@623] - Shutting down
    [junit] 2016-08-19 07:51:44,059 [myid:] - INFO  [main:JUnit4ZKTestRunner$LoggedInvokeMethod@82]
- Memory used 16084
    [junit] 2016-08-19 07:51:44,059 [myid:] - INFO  [main:JUnit4ZKTestRunner$LoggedInvokeMethod@87]
- Number of threads 5
    [junit] 2016-08-19 07:51:44,060 [myid:] - INFO  [main:JUnit4ZKTestRunner$LoggedInvokeMethod@102]
- FINISHED TEST METHOD testNormalRun
    [junit] 2016-08-19 07:51:44,060 [myid:] - INFO  [main:ZKTestCase$1@65] - SUCCEEDED testNormalRun
    [junit] 2016-08-19 07:51:44,060 [myid:] - INFO  [main:ZKTestCase$1@60] - FINISHED testNormalRun
    [junit] Tests run: 12, Failures: 0, Errors: 0, Time elapsed: 48.613 sec
    [junit] 2016-08-19 07:51:44,261 [myid:] - INFO  [SessionTracker:SessionTrackerImpl@158]
- SessionTrackerImpl exited loop!
    [junit] 2016-08-19 07:51:54,680 [myid:] - INFO  [main:JUnit4ZKTestRunner@47] - No test.method
specified. using default methods.
    [junit] Running org.apache.zookeeper.server.util.VerifyingFileFactoryTest
    [junit] 2016-08-19 07:51:56,047 [myid:] - INFO  [main:JUnit4ZKTestRunner@47] - No test.method
specified. using default methods.
    [junit] 2016-08-19 07:51:56,200 [myid:] - INFO  [main:ZKTestCase$1@55] - STARTING testFileHasCorrectPath
    [junit] 2016-08-19 07:51:56,217 [myid:] - INFO  [main:JUnit4ZKTestRunner$LoggedInvokeMethod@77]
- RUNNING TEST METHOD testFileHasCorrectPath
    [junit] 2016-08-19 07:51:56,352 [myid:] - INFO  [main:JUnit4ZKTestRunner$LoggedInvokeMethod@82]
- Memory used 9514
    [junit] 2016-08-19 07:51:56,355 [myid:] - INFO  [main:JUnit4ZKTestRunner$LoggedInvokeMethod@87]
- Number of threads 4
    [junit] 2016-08-19 07:51:56,355 [myid:] - INFO  [main:JUnit4ZKTestRunner$LoggedInvokeMethod@102]
- FINISHED TEST METHOD testFileHasCorrectPath
    [junit] 2016-08-19 07:51:56,355 [myid:] - INFO  [main:ZKTestCase$1@65] - SUCCEEDED testFileHasCorrectPath
    [junit] 2016-08-19 07:51:56,355 [myid:] - INFO  [main:ZKTestCase$1@60] - FINISHED testFileHasCorrectPath
    [junit] 2016-08-19 07:51:56,384 [myid:] - INFO  [main:ZKTestCase$1@55] - STARTING testForNoWarningOnIntendedRelativePath
    [junit] 2016-08-19 07:51:56,384 [myid:] - INFO  [main:JUnit4ZKTestRunner$LoggedInvokeMethod@77]
- RUNNING TEST METHOD testForNoWarningOnIntendedRelativePath
    [junit] 2016-08-19 07:51:56,385 [myid:] - INFO  [main:JUnit4ZKTestRunner$LoggedInvokeMethod@82]
- Memory used 9853
    [junit] 2016-08-19 07:51:56,385 [myid:] - INFO  [main:JUnit4ZKTestRunner$LoggedInvokeMethod@87]
- Number of threads 4
    [junit] 2016-08-19 07:51:56,385 [myid:] - INFO  [main:JUnit4ZKTestRunner$LoggedInvokeMethod@102]
- FINISHED TEST METHOD testForNoWarningOnIntendedRelativePath
    [junit] 2016-08-19 07:51:56,385 [myid:] - INFO  [main:ZKTestCase$1@65] - SUCCEEDED testForNoWarningOnIntendedRelativePath
    [junit] 2016-08-19 07:51:56,385 [myid:] - INFO  [main:ZKTestCase$1@60] - FINISHED testForNoWarningOnIntendedRelativePath
    [junit] 2016-08-19 07:51:56,387 [myid:] - INFO  [main:ZKTestCase$1@55] - STARTING testForWarningOnRelativePath
    [junit] 2016-08-19 07:51:56,388 [myid:] - INFO  [main:JUnit4ZKTestRunner$LoggedInvokeMethod@77]
- RUNNING TEST METHOD testForWarningOnRelativePath
    [junit] 2016-08-19 07:51:56,388 [myid:] - WARN  [main:VerifyingFileFactory@59] - a/relative/path
is relative. Prepend ./ to indicate that you're sure!
    [junit] 2016-08-19 07:51:56,388 [myid:] - INFO  [main:JUnit4ZKTestRunner$LoggedInvokeMethod@82]
- Memory used 9853
    [junit] 2016-08-19 07:51:56,388 [myid:] - INFO  [main:JUnit4ZKTestRunner$LoggedInvokeMethod@87]
- Number of threads 4
    [junit] 2016-08-19 07:51:56,388 [myid:] - INFO  [main:JUnit4ZKTestRunner$LoggedInvokeMethod@102]
- FINISHED TEST METHOD testForWarningOnRelativePath
    [junit] 2016-08-19 07:51:56,388 [myid:] - INFO  [main:ZKTestCase$1@65] - SUCCEEDED testForWarningOnRelativePath
    [junit] 2016-08-19 07:51:56,388 [myid:] - INFO  [main:ZKTestCase$1@60] - FINISHED testForWarningOnRelativePath
    [junit] 2016-08-19 07:51:56,389 [myid:] - INFO  [main:ZKTestCase$1@55] - STARTING testForFailForNonExistingPath
    [junit] 2016-08-19 07:51:56,389 [myid:] - INFO  [main:JUnit4ZKTestRunner$LoggedInvokeMethod@77]
- RUNNING TEST METHOD testForFailForNonExistingPath
    [junit] 2016-08-19 07:51:56,419 [myid:] - INFO  [main:JUnit4ZKTestRunner$LoggedInvokeMethod@95]
- TEST METHOD testForFailForNonExistingPath THREW EXPECTED EXCEPTION class java.lang.IllegalArgumentException
    [junit] 2016-08-19 07:51:56,419 [myid:] - INFO  [main:ZKTestCase$1@65] - SUCCEEDED testForFailForNonExistingPath
    [junit] 2016-08-19 07:51:56,419 [myid:] - INFO  [main:ZKTestCase$1@60] - FINISHED testForFailForNonExistingPath
    [junit] Tests run: 4, Failures: 0, Errors: 0, Time elapsed: 1.501 sec
    [junit] Running org.apache.zookeeper.test.ACLCountTest
    [junit] Tests run: 1, Failures: 0, Errors: 1, Time elapsed: 0 sec

BUILD FAILED
/zonestorage/hudson_solaris/home/hudson/hudson-slave/workspace/ZooKeeper-trunk-solaris/trunk/build.xml:1219:
Process fork failed.

Total time: 30 minutes 0 seconds
Build step 'Invoke Ant' marked build as failure
[locks-and-latches] Releasing all the locks
[locks-and-latches] All the locks released
Recording test results
Email was triggered for: Failure - Any
Sending email for trigger: Failure - Any



###################################################################################
############################## FAILED TESTS (if any) ##############################
1 tests failed.
FAILED:  org.apache.zookeeper.test.ACLCountTest.unknown

Error Message:
Forked Java VM exited abnormally. Please note the time in the report does not reflect the
time until the VM exit.

Stack Trace:
junit.framework.AssertionFailedError: Forked Java VM exited abnormally. Please note the time
in the report does not reflect the time until the VM exit.



Mime
  • Unnamed multipart/mixed (inline, None, 0 bytes)
View raw message