zookeeper-dev mailing list archives

Site index · List index
Message view « Date » · « Thread »
Top « Date » · « Thread »
From Apache Jenkins Server <jenk...@builds.apache.org>
Subject ZooKeeper_branch35_solaris - Build # 202 - Still Failing
Date Mon, 08 Aug 2016 16:53:03 GMT
See https://builds.apache.org/job/ZooKeeper_branch35_solaris/202/

###################################################################################
########################## LAST 60 LINES OF THE CONSOLE ###########################
[...truncated 144470 lines...]
    [junit] 2016-08-08 16:53:33,451 [myid:] - INFO  [NIOServerCxnFactory.SelectorThread-1:NIOServerCnxnFactory$SelectorThread@420]
- selector thread exitted run method
    [junit] 2016-08-08 16:53:33,451 [myid:] - INFO  [QuorumPeer[myid=0](plain=/0.0.0.0:11296)(secure=disabled):MBeanRegistry@128]
- Unregister MBean [org.apache.ZooKeeperService:name0=ReplicatedServer_id0,name1=replica.1]
    [junit] 2016-08-08 16:53:33,453 [myid:] - INFO  [LearnerCnxAcceptor-/127.0.0.1:11297:ZooKeeperServer$ZooKeeperServerListenerImpl@475]
- Thread LearnerCnxAcceptor-/127.0.0.1:11297 exits, error code 1
    [junit] 2016-08-08 16:53:33,452 [myid:] - WARN  [QuorumPeer[myid=1](plain=/0.0.0.0:11299)(secure=disabled):QuorumPeer@1127]
- Unexpected exception
    [junit] java.lang.InterruptedException
    [junit] 	at java.lang.Object.wait(Native Method)
    [junit] 	at org.apache.zookeeper.server.quorum.Leader.getEpochToPropose(Leader.java:1180)
    [junit] 	at org.apache.zookeeper.server.quorum.Leader.lead(Leader.java:430)
    [junit] 	at org.apache.zookeeper.server.quorum.QuorumPeer.run(QuorumPeer.java:1124)
    [junit] 2016-08-08 16:53:33,453 [myid:] - INFO  [/127.0.0.1:11301:QuorumCnxManager$Listener@659]
- Leaving listener
    [junit] 2016-08-08 16:53:33,454 [myid:] - INFO  [main:JUnit4ZKTestRunner$LoggedInvokeMethod@82]
- Memory used 9618
    [junit] 2016-08-08 16:53:33,453 [myid:] - INFO  [QuorumPeer[myid=2](plain=/0.0.0.0:11302)(secure=disabled):MBeanRegistry@128]
- Unregister MBean [org.apache.ZooKeeperService:name0=ReplicatedServer_id2,name1=replica.2,name2=LeaderElection]
    [junit] 2016-08-08 16:53:33,454 [myid:] - WARN  [QuorumPeer[myid=2](plain=/0.0.0.0:11302)(secure=disabled):QuorumPeer@1089]
- Unexpected exception
    [junit] java.lang.InterruptedException
    [junit] 	at java.util.concurrent.locks.AbstractQueuedSynchronizer$ConditionObject.reportInterruptAfterWait(AbstractQueuedSynchronizer.java:2017)
    [junit] 	at java.util.concurrent.locks.AbstractQueuedSynchronizer$ConditionObject.awaitNanos(AbstractQueuedSynchronizer.java:2095)
    [junit] 	at java.util.concurrent.LinkedBlockingQueue.poll(LinkedBlockingQueue.java:467)
    [junit] 	at org.apache.zookeeper.server.quorum.FastLeaderElection.lookForLeader(FastLeaderElection.java:908)
    [junit] 	at org.apache.zookeeper.server.quorum.QuorumPeer.run(QuorumPeer.java:1087)
    [junit] 2016-08-08 16:53:33,454 [myid:] - WARN  [QuorumPeer[myid=2](plain=/0.0.0.0:11302)(secure=disabled):QuorumPeer@1140]
- QuorumPeer main thread exited
    [junit] 2016-08-08 16:53:33,454 [myid:] - INFO  [QuorumPeer[myid=2](plain=/0.0.0.0:11302)(secure=disabled):MBeanRegistry@128]
- Unregister MBean [org.apache.ZooKeeperService:name0=ReplicatedServer_id2]
    [junit] 2016-08-08 16:53:33,454 [myid:] - INFO  [QuorumPeer[myid=2](plain=/0.0.0.0:11302)(secure=disabled):MBeanRegistry@128]
- Unregister MBean [org.apache.ZooKeeperService:name0=ReplicatedServer_id2,name1=replica.2]
    [junit] 2016-08-08 16:53:33,454 [myid:] - INFO  [QuorumPeer[myid=2](plain=/0.0.0.0:11302)(secure=disabled):MBeanRegistry@128]
- Unregister MBean [org.apache.ZooKeeperService:name0=ReplicatedServer_id2,name1=replica.0]
    [junit] 2016-08-08 16:53:33,454 [myid:] - INFO  [QuorumPeer[myid=2](plain=/0.0.0.0:11302)(secure=disabled):MBeanRegistry@128]
- Unregister MBean [org.apache.ZooKeeperService:name0=ReplicatedServer_id2,name1=replica.1]
    [junit] 2016-08-08 16:53:33,453 [myid:] - INFO  [QuorumPeer[myid=0](plain=/0.0.0.0:11296)(secure=disabled):MBeanRegistry@128]
- Unregister MBean [org.apache.ZooKeeperService:name0=ReplicatedServer_id0,name1=replica.2]
    [junit] 2016-08-08 16:53:33,454 [myid:] - INFO  [main:JUnit4ZKTestRunner$LoggedInvokeMethod@87]
- Number of threads 22
    [junit] 2016-08-08 16:53:33,454 [myid:] - INFO  [QuorumPeer[myid=1](plain=/0.0.0.0:11299)(secure=disabled):Leader@617]
- Shutting down
    [junit] 2016-08-08 16:53:33,455 [myid:] - WARN  [QuorumPeer[myid=1](plain=/0.0.0.0:11299)(secure=disabled):QuorumPeer@1158]
- PeerState set to LOOKING
    [junit] 2016-08-08 16:53:33,455 [myid:] - WARN  [QuorumPeer[myid=1](plain=/0.0.0.0:11299)(secure=disabled):QuorumPeer@1140]
- QuorumPeer main thread exited
    [junit] 2016-08-08 16:53:33,455 [myid:] - INFO  [main:JUnit4ZKTestRunner$LoggedInvokeMethod@102]
- FINISHED TEST METHOD testJoinInconsistentEnsemble
    [junit] 2016-08-08 16:53:33,455 [myid:] - INFO  [QuorumPeer[myid=1](plain=/0.0.0.0:11299)(secure=disabled):MBeanRegistry@128]
- Unregister MBean [org.apache.ZooKeeperService:name0=ReplicatedServer_id1]
    [junit] 2016-08-08 16:53:33,455 [myid:] - INFO  [main:ZKTestCase$1@65] - SUCCEEDED testJoinInconsistentEnsemble
    [junit] 2016-08-08 16:53:33,455 [myid:] - INFO  [main:ZKTestCase$1@60] - FINISHED testJoinInconsistentEnsemble
    [junit] 2016-08-08 16:53:33,455 [myid:] - INFO  [QuorumPeer[myid=1](plain=/0.0.0.0:11299)(secure=disabled):MBeanRegistry@128]
- Unregister MBean [org.apache.ZooKeeperService:name0=ReplicatedServer_id1,name1=replica.1]
    [junit] 2016-08-08 16:53:33,455 [myid:] - INFO  [QuorumPeer[myid=1](plain=/0.0.0.0:11299)(secure=disabled):MBeanRegistry@128]
- Unregister MBean [org.apache.ZooKeeperService:name0=ReplicatedServer_id1,name1=replica.0]
    [junit] 2016-08-08 16:53:33,456 [myid:] - INFO  [QuorumPeer[myid=1](plain=/0.0.0.0:11299)(secure=disabled):MBeanRegistry@128]
- Unregister MBean [org.apache.ZooKeeperService:name0=ReplicatedServer_id1,name1=replica.2]
    [junit] 2016-08-08 16:53:33,461 [myid:] - INFO  [WorkerSender[myid=0]:FastLeaderElection$Messenger$WorkerSender@470]
- WorkerSender is down
    [junit] 2016-08-08 16:53:33,461 [myid:] - INFO  [WorkerSender[myid=2]:FastLeaderElection$Messenger$WorkerSender@470]
- WorkerSender is down
    [junit] 2016-08-08 16:53:33,461 [myid:] - INFO  [WorkerSender[myid=1]:FastLeaderElection$Messenger$WorkerSender@470]
- WorkerSender is down
    [junit] 2016-08-08 16:53:33,511 [myid:] - INFO  [WorkerReceiver[myid=4]:FastLeaderElection$Messenger$WorkerReceiver@440]
- WorkerReceiver is down
    [junit] 2016-08-08 16:53:33,511 [myid:] - INFO  [WorkerReceiver[myid=2]:FastLeaderElection$Messenger$WorkerReceiver@440]
- WorkerReceiver is down
    [junit] 2016-08-08 16:53:33,511 [myid:] - INFO  [WorkerReceiver[myid=3]:FastLeaderElection$Messenger$WorkerReceiver@440]
- WorkerReceiver is down
    [junit] Tests run: 6, Failures: 0, Errors: 0, Time elapsed: 23.473 sec
    [junit] 2016-08-08 16:53:33,511 [myid:] - INFO  [WorkerReceiver[myid=5]:FastLeaderElection$Messenger$WorkerReceiver@440]
- WorkerReceiver is down
    [junit] 2016-08-08 16:53:33,581 [myid:] - INFO  [WorkerReceiver[myid=1]:FastLeaderElection$Messenger$WorkerReceiver@440]
- WorkerReceiver is down
    [junit] 2016-08-08 16:53:33,581 [myid:] - INFO  [WorkerReceiver[myid=0]:FastLeaderElection$Messenger$WorkerReceiver@440]
- WorkerReceiver is down
    [junit] Running org.apache.zookeeper.test.FLEZeroWeightTest
    [junit] Tests run: 1, Failures: 0, Errors: 1, Time elapsed: 0 sec

BUILD FAILED
/zonestorage/hudson_solaris/home/hudson/hudson-slave/workspace/ZooKeeper_branch35_solaris/branch-3.5/build.xml:1219:
Process fork failed.

Total time: 42 minutes 21 seconds
Build step 'Invoke Ant' marked build as failure
[locks-and-latches] Releasing all the locks
[locks-and-latches] All the locks released
Recording test results
Email was triggered for: Failure - Any
Sending email for trigger: Failure - Any



###################################################################################
############################## FAILED TESTS (if any) ##############################
2 tests failed.
FAILED:  org.apache.zookeeper.server.quorum.WatchLeakTest.testWatchesLeak[0]

Error Message:
Session is valid so the watch should be there expected:<1> but was:<0>

Stack Trace:
junit.framework.AssertionFailedError: Session is valid so the watch should be there expected:<1>
but was:<0>
	at org.apache.zookeeper.server.quorum.WatchLeakTest.testWatchesLeak(WatchLeakTest.java:168)
	at org.apache.zookeeper.JUnit4ZKTestRunner$LoggedInvokeMethod.evaluate(JUnit4ZKTestRunner.java:79)


FAILED:  org.apache.zookeeper.test.FLEZeroWeightTest.unknown

Error Message:
Forked Java VM exited abnormally. Please note the time in the report does not reflect the
time until the VM exit.

Stack Trace:
junit.framework.AssertionFailedError: Forked Java VM exited abnormally. Please note the time
in the report does not reflect the time until the VM exit.



Mime
  • Unnamed multipart/mixed (inline, None, 0 bytes)
View raw message