zookeeper-dev mailing list archives

Site index · List index
Message view « Date » · « Thread »
Top « Date » · « Thread »
From Apache Jenkins Server <jenk...@builds.apache.org>
Subject ZooKeeper_branch35_openjdk7 - Build # 175 - Failure
Date Tue, 02 Aug 2016 10:14:30 GMT
See https://builds.apache.org/job/ZooKeeper_branch35_openjdk7/175/

###################################################################################
########################## LAST 60 LINES OF THE CONSOLE ###########################
[...truncated 443257 lines...]
     [exec] Log Message Received: [2016-08-02 10:05:25,345:835(0x2b8f4d70d540):ZOO_INFO@testLogCallbackInit@993:
testLogCallbackInit #8]
     [exec] Log Message Received: [2016-08-02 10:05:25,345:835(0x2b8f4d70d540):ZOO_INFO@testLogCallbackInit@993:
testLogCallbackInit #9]
     [exec] Log Message Received: [2016-08-02 10:05:25,346:835(0x2b8f4d70d540):ZOO_INFO@zookeeper_close@3257:
Closing zookeeper sessionId=0x101a45976ba000d to [127.0.0.1:22181]
     [exec] ]
     [exec]  : elapsed 1000 : OK
     [exec] Zookeeper_simpleSystem::testLogCallbackClearLog Message Received: [2016-08-02
10:05:25,346:835(0x2b8f4d70d540):ZOO_INFO@log_env@1027: Client environment:zookeeper.version=zookeeper
C client 3.5.2]
     [exec] Log Message Received: [2016-08-02 10:05:25,346:835(0x2b8f4d70d540):ZOO_INFO@log_env@1031:
Client environment:host.name=penates.apache.org]
     [exec] Log Message Received: [2016-08-02 10:05:25,346:835(0x2b8f4d70d540):ZOO_INFO@log_env@1038:
Client environment:os.name=Linux]
     [exec] Log Message Received: [2016-08-02 10:05:25,346:835(0x2b8f4d70d540):ZOO_INFO@log_env@1039:
Client environment:os.arch=3.13.0-36-lowlatency]
     [exec] Log Message Received: [2016-08-02 10:05:25,346:835(0x2b8f4d70d540):ZOO_INFO@log_env@1040:
Client environment:os.version=#63-Ubuntu SMP PREEMPT Wed Sep 3 21:56:12 UTC 2014]
     [exec] Log Message Received: [2016-08-02 10:05:25,346:835(0x2b8f4d70d540):ZOO_INFO@log_env@1048:
Client environment:user.name=jenkins]
     [exec] Log Message Received: [2016-08-02 10:05:25,346:835(0x2b8f4d70d540):ZOO_INFO@log_env@1056:
Client environment:user.home=/home/jenkins]
     [exec] Log Message Received: [2016-08-02 10:05:25,346:835(0x2b8f4d70d540):ZOO_INFO@log_env@1068:
Client environment:user.dir=/home/jenkins/jenkins-slave/workspace/ZooKeeper_branch35_openjdk7/branch-3.5/build/test/test-cppunit]
     [exec] Log Message Received: [2016-08-02 10:05:25,346:835(0x2b8f4d70d540):ZOO_INFO@zookeeper_init_internal@1111:
Initiating client connection, host=127.0.0.1:22181 sessionTimeout=10000 watcher=0x45d2a0 sessionId=0
sessionPasswd=<null> context=0x7fffc5be1250 flags=0]
     [exec] Log Message Received: [2016-08-02 10:05:25,346:835(0x2b8f4f76a700):ZOO_INFO@check_events@2357:
initiated connection to server [127.0.0.1:22181]]
     [exec] Log Message Received: [2016-08-02 10:05:25,670:835(0x2b8f4f76a700):ZOO_INFO@check_events@2409:
session establishment complete on server [127.0.0.1:22181], sessionId=0x101a45976ba000e, negotiated
timeout=10000 ]
     [exec]  : elapsed 1000 : OK
     [exec] Zookeeper_simpleSystem::testAsyncWatcherAutoReset ZooKeeper server started : elapsed
9778 : OK
     [exec] Zookeeper_simpleSystem::testDeserializeString : elapsed 0 : OK
     [exec] Zookeeper_simpleSystem::testFirstServerDown : elapsed 1001 : OK
     [exec] Zookeeper_simpleSystem::testNullData : elapsed 1040 : OK
     [exec] Zookeeper_simpleSystem::testIPV6 : elapsed 1024 : OK
     [exec] Zookeeper_simpleSystem::testCreate : elapsed 1031 : OK
     [exec] Zookeeper_simpleSystem::testPath : elapsed 1074 : OK
     [exec] Zookeeper_simpleSystem::testPathValidation : elapsed 1150 : OK
     [exec] Zookeeper_simpleSystem::testPing : elapsed 17786 : OK
     [exec] Zookeeper_simpleSystem::testAcl : elapsed 1037 : OK
     [exec] Zookeeper_simpleSystem::testChroot : elapsed 3104 : OK
     [exec] Zookeeper_simpleSystem::testAuth ZooKeeper server started ZooKeeper server started
: elapsed 29699 : OK
     [exec] Zookeeper_simpleSystem::testHangingClient : elapsed 1051 : OK
     [exec] Zookeeper_simpleSystem::testWatcherAutoResetWithGlobal ZooKeeper server started
ZooKeeper server started ZooKeeper server started : elapsed 13977 : OK
     [exec] Zookeeper_simpleSystem::testWatcherAutoResetWithLocal ZooKeeper server started
ZooKeeper server started ZooKeeper server started : elapsed 14190 : OK
     [exec] Zookeeper_simpleSystem::testGetChildren2 : elapsed 1073 : OK
     [exec] Zookeeper_simpleSystem::testLastZxid : elapsed 4535 : OK
     [exec] Zookeeper_simpleSystem::testRemoveWatchers ZooKeeper server started : elapsed
2893 : OK
     [exec] Zookeeper_readOnly::testReadOnly : elapsed 4260 : OK
     [exec] /home/jenkins/jenkins-slave/workspace/ZooKeeper_branch35_openjdk7/branch-3.5/src/c/tests/TestReconfig.cc:490:
Assertion: assertion failed [Expression: found != string::npos]
     [exec] Failures !!!
     [exec] Run: 72   Failure total: 1   Failures: 1   Errors: 0
     [exec] FAIL: zktest-mt
     [exec] ==========================================
     [exec] 1 of 2 tests failed
     [exec] Please report to user@zookeeper.apache.org
     [exec] ==========================================
     [exec] make[1]: Leaving directory `/home/jenkins/jenkins-slave/workspace/ZooKeeper_branch35_openjdk7/branch-3.5/build/test/test-cppunit'
     [exec] make[1]: *** [check-TESTS] Error 1
     [exec] make: *** [check-am] Error 2

BUILD FAILED
/home/jenkins/jenkins-slave/workspace/ZooKeeper_branch35_openjdk7/branch-3.5/build.xml:1322:
The following error occurred while executing this line:
/home/jenkins/jenkins-slave/workspace/ZooKeeper_branch35_openjdk7/branch-3.5/build.xml:1282:
The following error occurred while executing this line:
/home/jenkins/jenkins-slave/workspace/ZooKeeper_branch35_openjdk7/branch-3.5/build.xml:1292:
exec returned: 2

Total time: 17 minutes 51 seconds
Build step 'Invoke Ant' marked build as failure
Archiving artifacts
Recording test results
Email was triggered for: Failure - Any
Sending email for trigger: Failure - Any



###################################################################################
############################## FAILED TESTS (if any) ##############################
All tests passed
Mime
  • Unnamed multipart/mixed (inline, None, 0 bytes)
View raw message