zookeeper-dev mailing list archives

Site index · List index
Message view « Date » · « Thread »
Top « Date » · « Thread »
From Apache Jenkins Server <jenk...@builds.apache.org>
Subject ZooKeeper-trunk-solaris - Build # 1269 - Still Failing
Date Sat, 13 Aug 2016 14:16:33 GMT
See https://builds.apache.org/job/ZooKeeper-trunk-solaris/1269/

###################################################################################
########################## LAST 60 LINES OF THE CONSOLE ###########################
[...truncated 294325 lines...]
    [junit] 	at org.apache.zookeeper.server.quorum.QuorumPeer.shutdown(QuorumPeer.java:1184)
    [junit] 	at org.apache.zookeeper.test.QuorumBase.shutdown(QuorumBase.java:395)
    [junit] 	at org.apache.zookeeper.server.quorum.QuorumPeerTestBase$TestQPMain.shutdown(QuorumPeerTestBase.java:60)
    [junit] 	at org.apache.zookeeper.server.quorum.QuorumPeerTestBase$MainThread.shutdown(QuorumPeerTestBase.java:257)
    [junit] 	at org.apache.zookeeper.test.NonRecoverableErrorTest.testZooKeeperServiceAvailableOnLeader(NonRecoverableErrorTest.java:151)
    [junit] 	at sun.reflect.NativeMethodAccessorImpl.invoke0(Native Method)
    [junit] 	at sun.reflect.NativeMethodAccessorImpl.invoke(NativeMethodAccessorImpl.java:57)
    [junit] 	at sun.reflect.DelegatingMethodAccessorImpl.invoke(DelegatingMethodAccessorImpl.java:43)
    [junit] 	at java.lang.reflect.Method.invoke(Method.java:606)
    [junit] 	at org.junit.runners.model.FrameworkMethod$1.runReflectiveCall(FrameworkMethod.java:50)
    [junit] 	at org.junit.internal.runners.model.ReflectiveCallable.run(ReflectiveCallable.java:12)
    [junit] 	at org.junit.runners.model.FrameworkMethod.invokeExplosively(FrameworkMethod.java:47)
    [junit] 	at org.junit.internal.runners.statements.InvokeMethod.evaluate(InvokeMethod.java:17)
    [junit] 	at org.apache.zookeeper.JUnit4ZKTestRunner$LoggedInvokeMethod.evaluate(JUnit4ZKTestRunner.java:79)
    [junit] 	at org.junit.internal.runners.statements.FailOnTimeout$CallableStatement.call(FailOnTimeout.java:298)
    [junit] 	at org.junit.internal.runners.statements.FailOnTimeout$CallableStatement.call(FailOnTimeout.java:292)
    [junit] 	at java.util.concurrent.FutureTask.run(FutureTask.java:262)
    [junit] 	at java.lang.Thread.run(Thread.java:745)
    [junit] 2016-08-13 14:17:21,276 [myid:2] - INFO  [QuorumPeer[myid=2](plain=/127.0.0.1:11228)(secure=disabled):ZooKeeperServer@529]
- shutting down
    [junit] 2016-08-13 14:17:21,277 [myid:2] - INFO  [QuorumPeer[myid=2](plain=/127.0.0.1:11228)(secure=disabled):FollowerRequestProcessor@138]
- Shutting down
    [junit] 2016-08-13 14:17:21,277 [myid:2] - INFO  [QuorumPeer[myid=2](plain=/127.0.0.1:11228)(secure=disabled):CommitProcessor@414]
- Shutting down
    [junit] 2016-08-13 14:17:21,277 [myid:2] - INFO  [FollowerRequestProcessor:2:FollowerRequestProcessor@109]
- FollowerRequestProcessor exited loop!
    [junit] 2016-08-13 14:17:21,311 [myid:2] - INFO  [QuorumPeer[myid=2](plain=/127.0.0.1:11228)(secure=disabled):FinalRequestProcessor@479]
- shutdown of request processor complete
    [junit] 2016-08-13 14:17:21,311 [myid:2] - INFO  [CommitProcessor:2:CommitProcessor@299]
- CommitProcessor exited loop!
    [junit] 2016-08-13 14:17:21,312 [myid:2] - INFO  [QuorumPeer[myid=2](plain=/127.0.0.1:11228)(secure=disabled):MBeanRegistry@128]
- Unregister MBean [org.apache.ZooKeeperService:name0=ReplicatedServer_id2,name1=replica.2,name2=Follower,name3=InMemoryDataTree]
    [junit] 2016-08-13 14:17:21,312 [myid:2] - INFO  [QuorumPeer[myid=2](plain=/127.0.0.1:11228)(secure=disabled):SyncRequestProcessor@191]
- Shutting down
    [junit] 2016-08-13 14:17:21,312 [myid:2] - INFO  [SyncThread:2:SyncRequestProcessor@169]
- SyncRequestProcessor exited!
    [junit] 2016-08-13 14:17:21,312 [myid:2] - WARN  [QuorumPeer[myid=2](plain=/127.0.0.1:11228)(secure=disabled):QuorumPeer@1158]
- PeerState set to LOOKING
    [junit] 2016-08-13 14:17:21,312 [myid:2] - WARN  [QuorumPeer[myid=2](plain=/127.0.0.1:11228)(secure=disabled):QuorumPeer@1140]
- QuorumPeer main thread exited
    [junit] 2016-08-13 14:17:21,313 [myid:2] - INFO  [QuorumPeer[myid=2](plain=/127.0.0.1:11228)(secure=disabled):MBeanRegistry@128]
- Unregister MBean [org.apache.ZooKeeperService:name0=ReplicatedServer_id2]
    [junit] 2016-08-13 14:17:21,313 [myid:2] - INFO  [ConnnectionExpirer:NIOServerCnxnFactory$ConnectionExpirerThread@583]
- ConnnectionExpirerThread interrupted
    [junit] 2016-08-13 14:17:21,313 [myid:2] - INFO  [NIOServerCxnFactory.AcceptThread:/127.0.0.1:11228:NIOServerCnxnFactory$AcceptThread@219]
- accept thread exitted run method
    [junit] 2016-08-13 14:17:21,313 [myid:2] - INFO  [NIOServerCxnFactory.SelectorThread-0:NIOServerCnxnFactory$SelectorThread@420]
- selector thread exitted run method
    [junit] 2016-08-13 14:17:21,313 [myid:2] - INFO  [QuorumPeer[myid=2](plain=/127.0.0.1:11228)(secure=disabled):MBeanRegistry@128]
- Unregister MBean [org.apache.ZooKeeperService:name0=ReplicatedServer_id2,name1=replica.2]
    [junit] 2016-08-13 14:17:21,313 [myid:2] - INFO  [NIOServerCxnFactory.SelectorThread-1:NIOServerCnxnFactory$SelectorThread@420]
- selector thread exitted run method
    [junit] 2016-08-13 14:17:21,314 [myid:2] - INFO  [QuorumPeer[myid=2](plain=/127.0.0.1:11228)(secure=disabled):MBeanRegistry@128]
- Unregister MBean [org.apache.ZooKeeperService:name0=ReplicatedServer_id2,name1=replica.0]
    [junit] 2016-08-13 14:17:21,315 [myid:2] - INFO  [/127.0.0.1:11230:QuorumCnxManager$Listener@661]
- Leaving listener
    [junit] 2016-08-13 14:17:21,315 [myid:2] - INFO  [QuorumPeer[myid=2](plain=/127.0.0.1:11228)(secure=disabled):MBeanRegistry@128]
- Unregister MBean [org.apache.ZooKeeperService:name0=ReplicatedServer_id2,name1=replica.1]
    [junit] 2016-08-13 14:17:21,315 [myid:] - INFO  [Time-limited test:QuorumBase@398] - Shutting
down leader election QuorumPeer[myid=2](plain=/127.0.0.1:11228)(secure=disabled)
    [junit] 2016-08-13 14:17:21,315 [myid:] - INFO  [Time-limited test:QuorumBase@403] - Waiting
for QuorumPeer[myid=2](plain=/127.0.0.1:11228)(secure=disabled) to exit thread
    [junit] 2016-08-13 14:17:21,315 [myid:] - INFO  [Time-limited test:JUnit4ZKTestRunner$LoggedInvokeMethod@82]
- Memory used 11072
    [junit] 2016-08-13 14:17:21,316 [myid:] - INFO  [Time-limited test:JUnit4ZKTestRunner$LoggedInvokeMethod@87]
- Number of threads 13
    [junit] 2016-08-13 14:17:21,316 [myid:] - INFO  [Time-limited test:JUnit4ZKTestRunner$LoggedInvokeMethod@102]
- FINISHED TEST METHOD testZooKeeperServiceAvailableOnLeader
    [junit] 2016-08-13 14:17:21,316 [myid:] - INFO  [main:ZKTestCase$1@65] - SUCCEEDED testZooKeeperServiceAvailableOnLeader
    [junit] 2016-08-13 14:17:21,316 [myid:] - INFO  [main:ZKTestCase$1@60] - FINISHED testZooKeeperServiceAvailableOnLeader
    [junit] Tests run: 1, Failures: 0, Errors: 0, Time elapsed: 12.99 sec
    [junit] Running org.apache.zookeeper.test.NullDataTest
    [junit] Tests run: 1, Failures: 0, Errors: 1, Time elapsed: 0 sec

BUILD FAILED
/zonestorage/hudson_solaris/home/hudson/hudson-slave/workspace/ZooKeeper-trunk-solaris/trunk/build.xml:1219:
Process fork failed.

Total time: 60 minutes 25 seconds
Build step 'Invoke Ant' marked build as failure
[locks-and-latches] Releasing all the locks
[locks-and-latches] All the locks released
Recording test results
Email was triggered for: Failure - Any
Sending email for trigger: Failure - Any



###################################################################################
############################## FAILED TESTS (if any) ##############################
3 tests failed.
FAILED:  org.apache.zookeeper.server.quorum.ReconfigRecoveryTest.testNextConfigCompletion

Error Message:
Forked Java VM exited abnormally. Please note the time in the report does not reflect the
time until the VM exit.

Stack Trace:
junit.framework.AssertionFailedError: Forked Java VM exited abnormally. Please note the time
in the report does not reflect the time until the VM exit.


FAILED:  org.apache.zookeeper.test.NioNettySuiteTest.testRoleChange

Error Message:
Forked Java VM exited abnormally. Please note the time in the report does not reflect the
time until the VM exit.

Stack Trace:
junit.framework.AssertionFailedError: Forked Java VM exited abnormally. Please note the time
in the report does not reflect the time until the VM exit.


FAILED:  org.apache.zookeeper.test.NullDataTest.unknown

Error Message:
Forked Java VM exited abnormally. Please note the time in the report does not reflect the
time until the VM exit.

Stack Trace:
junit.framework.AssertionFailedError: Forked Java VM exited abnormally. Please note the time
in the report does not reflect the time until the VM exit.



Mime
  • Unnamed multipart/mixed (inline, None, 0 bytes)
View raw message