zookeeper-dev mailing list archives

Site index · List index
Message view « Date » · « Thread »
Top « Date » · « Thread »
From Apache Jenkins Server <jenk...@builds.apache.org>
Subject ZooKeeper_branch35_jdk7 - Build # 607 - Failure
Date Tue, 02 Aug 2016 09:35:08 GMT
See https://builds.apache.org/job/ZooKeeper_branch35_jdk7/607/

###################################################################################
########################## LAST 60 LINES OF THE CONSOLE ###########################
[...truncated 442080 lines...]
    [junit] 2016-08-02 09:34:54,613 [myid:] - INFO  [main:FourLetterWordMain@85] - connecting
to 127.0.0.1 11222
    [junit] 2016-08-02 09:34:54,614 [myid:] - INFO  [main:JMXEnv@146] - ensureOnly:[]
    [junit] 2016-08-02 09:34:54,616 [myid:] - INFO  [main:ClientBase@466] - STARTING server
    [junit] 2016-08-02 09:34:54,616 [myid:] - INFO  [main:ClientBase@386] - CREATING server
instance 127.0.0.1:11222
    [junit] 2016-08-02 09:34:54,617 [myid:] - INFO  [main:NIOServerCnxnFactory@673] - Configuring
NIO connection handler with 10s sessionless connection timeout, 1 selector thread(s), 8 worker
threads, and 64 kB direct buffers.
    [junit] 2016-08-02 09:34:54,618 [myid:] - INFO  [main:NIOServerCnxnFactory@686] - binding
to port 0.0.0.0/0.0.0.0:11222
    [junit] 2016-08-02 09:34:54,618 [myid:] - INFO  [main:ClientBase@361] - STARTING server
instance 127.0.0.1:11222
    [junit] 2016-08-02 09:34:54,619 [myid:] - INFO  [main:ZooKeeperServer@858] - minSessionTimeout
set to 6000
    [junit] 2016-08-02 09:34:54,619 [myid:] - INFO  [main:ZooKeeperServer@867] - maxSessionTimeout
set to 60000
    [junit] 2016-08-02 09:34:54,620 [myid:] - INFO  [main:ZooKeeperServer@156] - Created server
with tickTime 3000 minSessionTimeout 6000 maxSessionTimeout 60000 datadir /home/jenkins/jenkins-slave/workspace/ZooKeeper_branch35_jdk7/branch-3.5/build/test/tmp/test1458171829619585090.junit.dir/version-2
snapdir /home/jenkins/jenkins-slave/workspace/ZooKeeper_branch35_jdk7/branch-3.5/build/test/tmp/test1458171829619585090.junit.dir/version-2
    [junit] 2016-08-02 09:34:54,621 [myid:] - INFO  [main:FileSnap@83] - Reading snapshot
/home/jenkins/jenkins-slave/workspace/ZooKeeper_branch35_jdk7/branch-3.5/build/test/tmp/test1458171829619585090.junit.dir/version-2/snapshot.b
    [junit] 2016-08-02 09:34:54,626 [myid:] - INFO  [main:FileTxnSnapLog@298] - Snapshotting:
0xb to /home/jenkins/jenkins-slave/workspace/ZooKeeper_branch35_jdk7/branch-3.5/build/test/tmp/test1458171829619585090.junit.dir/version-2/snapshot.b
    [junit] 2016-08-02 09:34:54,629 [myid:] - INFO  [main:FourLetterWordMain@85] - connecting
to 127.0.0.1 11222
    [junit] 2016-08-02 09:34:54,630 [myid:] - INFO  [NIOServerCxnFactory.AcceptThread:0.0.0.0/0.0.0.0:11222:NIOServerCnxnFactory$AcceptThread@296]
- Accepted socket connection from /127.0.0.1:50043
    [junit] 2016-08-02 09:34:54,631 [myid:] - INFO  [NIOWorkerThread-1:NIOServerCnxn@485]
- Processing stat command from /127.0.0.1:50043
    [junit] 2016-08-02 09:34:54,631 [myid:] - INFO  [NIOWorkerThread-1:StatCommand@49] - Stat
command output
    [junit] 2016-08-02 09:34:54,632 [myid:] - INFO  [NIOWorkerThread-1:NIOServerCnxn@607]
- Closed socket connection for client /127.0.0.1:50043 (no session established for client)
    [junit] 2016-08-02 09:34:54,632 [myid:] - INFO  [main:JMXEnv@228] - ensureParent:[InMemoryDataTree,
StandaloneServer_port]
    [junit] 2016-08-02 09:34:54,635 [myid:] - INFO  [main:JMXEnv@245] - expect:InMemoryDataTree
    [junit] 2016-08-02 09:34:54,635 [myid:] - INFO  [main:JMXEnv@249] - found:InMemoryDataTree
org.apache.ZooKeeperService:name0=StandaloneServer_port11222,name1=InMemoryDataTree
    [junit] 2016-08-02 09:34:54,635 [myid:] - INFO  [main:JMXEnv@245] - expect:StandaloneServer_port
    [junit] 2016-08-02 09:34:54,635 [myid:] - INFO  [main:JMXEnv@249] - found:StandaloneServer_port
org.apache.ZooKeeperService:name0=StandaloneServer_port11222
    [junit] 2016-08-02 09:34:54,636 [myid:] - INFO  [main:JUnit4ZKTestRunner$LoggedInvokeMethod@82]
- Memory used 15599
    [junit] 2016-08-02 09:34:54,636 [myid:] - INFO  [main:JUnit4ZKTestRunner$LoggedInvokeMethod@87]
- Number of threads 22
    [junit] 2016-08-02 09:34:54,636 [myid:] - INFO  [main:JUnit4ZKTestRunner$LoggedInvokeMethod@102]
- FINISHED TEST METHOD testQuota
    [junit] 2016-08-02 09:34:54,636 [myid:] - INFO  [main:ClientBase@543] - tearDown starting
    [junit] 2016-08-02 09:34:54,681 [myid:] - INFO  [main:ZooKeeper@1313] - Session: 0x1000138c9050000
closed
    [junit] 2016-08-02 09:34:54,681 [myid:] - INFO  [main:ClientBase@513] - STOPPING server
    [junit] 2016-08-02 09:34:54,681 [myid:] - INFO  [main-EventThread:ClientCnxn$EventThread@513]
- EventThread shut down for session: 0x1000138c9050000
    [junit] 2016-08-02 09:34:54,682 [myid:] - INFO  [ConnnectionExpirer:NIOServerCnxnFactory$ConnectionExpirerThread@583]
- ConnnectionExpirerThread interrupted
    [junit] 2016-08-02 09:34:54,682 [myid:] - INFO  [NIOServerCxnFactory.SelectorThread-0:NIOServerCnxnFactory$SelectorThread@420]
- selector thread exitted run method
    [junit] 2016-08-02 09:34:54,682 [myid:] - INFO  [NIOServerCxnFactory.AcceptThread:0.0.0.0/0.0.0.0:11222:NIOServerCnxnFactory$AcceptThread@219]
- accept thread exitted run method
    [junit] 2016-08-02 09:34:54,682 [myid:] - INFO  [main:ZooKeeperServer@498] - shutting
down
    [junit] 2016-08-02 09:34:54,683 [myid:] - INFO  [main:SessionTrackerImpl@232] - Shutting
down
    [junit] 2016-08-02 09:34:54,683 [myid:] - INFO  [main:PrepRequestProcessor@965] - Shutting
down
    [junit] 2016-08-02 09:34:54,683 [myid:] - INFO  [main:SyncRequestProcessor@191] - Shutting
down
    [junit] 2016-08-02 09:34:54,683 [myid:] - INFO  [ProcessThread(sid:0 cport:11222)::PrepRequestProcessor@154]
- PrepRequestProcessor exited loop!
    [junit] 2016-08-02 09:34:54,684 [myid:] - INFO  [SyncThread:0:SyncRequestProcessor@169]
- SyncRequestProcessor exited!
    [junit] 2016-08-02 09:34:54,684 [myid:] - INFO  [main:FinalRequestProcessor@479] - shutdown
of request processor complete
    [junit] 2016-08-02 09:34:54,685 [myid:] - INFO  [main:MBeanRegistry@128] - Unregister
MBean [org.apache.ZooKeeperService:name0=StandaloneServer_port11222,name1=InMemoryDataTree]
    [junit] 2016-08-02 09:34:54,685 [myid:] - INFO  [main:MBeanRegistry@128] - Unregister
MBean [org.apache.ZooKeeperService:name0=StandaloneServer_port11222]
    [junit] 2016-08-02 09:34:54,686 [myid:] - INFO  [main:FourLetterWordMain@85] - connecting
to 127.0.0.1 11222
    [junit] 2016-08-02 09:34:54,687 [myid:] - INFO  [main:JMXEnv@146] - ensureOnly:[]
    [junit] 2016-08-02 09:34:54,693 [myid:] - INFO  [main:ClientBase@568] - fdcount after
test is: 47 at start it was 36
    [junit] 2016-08-02 09:34:54,694 [myid:] - INFO  [main:ClientBase@570] - sleeping for 20
secs
    [junit] 2016-08-02 09:34:54,696 [myid:] - INFO  [main:ZKTestCase$1@65] - SUCCEEDED testQuota
    [junit] 2016-08-02 09:34:54,696 [myid:] - INFO  [main:ZKTestCase$1@60] - FINISHED testQuota
    [junit] Tests run: 1, Failures: 0, Errors: 0, Time elapsed: 0.83 sec

BUILD FAILED
/home/jenkins/jenkins-slave/workspace/ZooKeeper_branch35_jdk7/branch-3.5/build.xml:1322: The
following error occurred while executing this line:
/home/jenkins/jenkins-slave/workspace/ZooKeeper_branch35_jdk7/branch-3.5/build.xml:1233: Tests
failed!

Total time: 56 minutes 22 seconds
Build step 'Invoke Ant' marked build as failure
Archiving artifacts
Recording test results
Email was triggered for: Failure - Any
Sending email for trigger: Failure - Any



###################################################################################
############################## FAILED TESTS (if any) ##############################
1 tests failed.
FAILED:  org.apache.zookeeper.server.quorum.ReconfigRecoveryTest.testCurrentServersAreObserversInNextConfig

Error Message:
waiting for server 4 being up

Stack Trace:
junit.framework.AssertionFailedError: waiting for server 4 being up
	at org.apache.zookeeper.server.quorum.ReconfigRecoveryTest.testCurrentServersAreObserversInNextConfig(ReconfigRecoveryTest.java:217)
	at org.apache.zookeeper.JUnit4ZKTestRunner$LoggedInvokeMethod.evaluate(JUnit4ZKTestRunner.java:79)



Mime
  • Unnamed multipart/mixed (inline, None, 0 bytes)
View raw message