zookeeper-dev mailing list archives

Site index · List index
Message view « Date » · « Thread »
Top « Date » · « Thread »
From Apache Jenkins Server <jenk...@builds.apache.org>
Subject ZooKeeper-trunk - Build # 3021 - Failure
Date Thu, 04 Aug 2016 01:27:34 GMT
See https://builds.apache.org/job/ZooKeeper-trunk/3021/

###################################################################################
########################## LAST 60 LINES OF THE CONSOLE ###########################
[...truncated 446395 lines...]
     [exec] ZooKeeper JMX enabled by default
     [exec] Using config: /home/jenkins/jenkins-slave/workspace/ZooKeeper-trunk/trunk/src/c/../../build/test/test-cppunit/conf/2.conf
     [exec] ZooKeeper JMX enabled by default
     [exec] Using config: /home/jenkins/jenkins-slave/workspace/ZooKeeper-trunk/trunk/src/c/../../build/test/test-cppunit/conf/0.conf
     [exec] ZooKeeper JMX enabled by default
     [exec] Using config: /home/jenkins/jenkins-slave/workspace/ZooKeeper-trunk/trunk/src/c/../../build/test/test-cppunit/conf/1.conf
     [exec] ZooKeeper JMX enabled by default
     [exec] Using config: /home/jenkins/jenkins-slave/workspace/ZooKeeper-trunk/trunk/src/c/../../build/test/test-cppunit/conf/0.conf
     [exec] ZooKeeper JMX enabled by default
     [exec] Using config: /home/jenkins/jenkins-slave/workspace/ZooKeeper-trunk/trunk/src/c/../../build/test/test-cppunit/conf/1.conf
     [exec] ZooKeeper JMX enabled by default
     [exec] Using config: /home/jenkins/jenkins-slave/workspace/ZooKeeper-trunk/trunk/src/c/../../build/test/test-cppunit/conf/2.conf
     [exec] Stopping zookeeper ... STOPPED
     [exec] Stopping zookeeper ... STOPPED
     [exec] ZooKeeper JMX enabled by default
     [exec] Using config: /home/jenkins/jenkins-slave/workspace/ZooKeeper-trunk/trunk/src/c/../../build/test/test-cppunit/conf/0.conf
     [exec] ZooKeeper JMX enabled by default
     [exec] Using config: /home/jenkins/jenkins-slave/workspace/ZooKeeper-trunk/trunk/src/c/../../build/test/test-cppunit/conf/1.conf
     [exec] ZooKeeper JMX enabled by default
     [exec] Using config: /home/jenkins/jenkins-slave/workspace/ZooKeeper-trunk/trunk/src/c/../../build/test/test-cppunit/conf/2.conf
     [exec] Stopping zookeeper ... STOPPED
     [exec]  : elapsed 6558 : OK
     [exec] Zookeeper_clientretry::testRetry ZooKeeper server started ZooKeeper server started
: elapsed 4101 : OK
     [exec] Zookeeper_operations::testAsyncWatcher1 : elapsed 4 : OK
     [exec] Zookeeper_operations::testAsyncGetOperation : elapsed 4 : OK
     [exec] Zookeeper_operations::testOperationsAndDisconnectConcurrently1 : elapsed 377 :
OK
     [exec] Zookeeper_operations::testOperationsAndDisconnectConcurrently2 : elapsed 0 : OK
Build timed out (after 120 minutes). Marking the build as failed.
Build was aborted
[FINDBUGS] Skipping publisher since build result is FAILURE
[WARNINGS] Skipping publisher since build result is FAILURE
Archiving artifacts
     [exec] Zookeeper_operations::testConcurrentOperations1FAIL: zktest-mt
     [exec] ==========================================
     [exec] 2 of 2 tests failed
     [exec] Please report to user@zookeeper.apache.org
     [exec] ==========================================
     [exec] make[1]: Leaving directory `/home/jenkins/jenkins-slave/workspace/ZooKeeper-trunk/trunk/build/test/test-cppunit'
     [exec] /bin/bash: line 5: 16270 Terminated              ZKROOT=/home/jenkins/jenkins-slave/workspace/ZooKeeper-trunk/trunk/src/c/../..
CLASSPATH=$CLASSPATH:$CLOVER_HOME/lib/clover.jar ${dir}$tst
     [exec] make[1]: *** [check-TESTS] Error 1
     [exec] make: *** [check-am] Error 2

BUILD FAILED
/home/jenkins/jenkins-slave/workspace/ZooKeeper-trunk/trunk/build.xml:1322: The following
error occurred while executing this line:
/home/jenkins/jenkins-slave/workspace/ZooKeeper-trunk/trunk/build.xml:1282: The following
error occurred while executing this line:
/home/jenkins/jenkins-slave/workspace/ZooKeeper-trunk/trunk/build.xml:1292: exec returned:
2

Total time: 118 minutes 16 seconds
Setting LATEST1_7_HOME=/home/jenkins/jenkins-slave/tools/hudson.model.JDK/latest1.7
Recording fingerprints
Setting LATEST1_7_HOME=/home/jenkins/jenkins-slave/tools/hudson.model.JDK/latest1.7
Recording test results
Setting LATEST1_7_HOME=/home/jenkins/jenkins-slave/tools/hudson.model.JDK/latest1.7
Publishing Javadoc
Setting LATEST1_7_HOME=/home/jenkins/jenkins-slave/tools/hudson.model.JDK/latest1.7
Email was triggered for: Failure - Any
Sending email for trigger: Failure - Any
Setting LATEST1_7_HOME=/home/jenkins/jenkins-slave/tools/hudson.model.JDK/latest1.7
Setting LATEST1_7_HOME=/home/jenkins/jenkins-slave/tools/hudson.model.JDK/latest1.7



###################################################################################
############################## FAILED TESTS (if any) ##############################
All tests passed
Mime
  • Unnamed multipart/mixed (inline, None, 0 bytes)
View raw message