zookeeper-dev mailing list archives

Site index · List index
Message view « Date » · « Thread »
Top « Date » · « Thread »
From Apache Jenkins Server <jenk...@builds.apache.org>
Subject ZooKeeper_branch35_solaris - Build # 220 - Still Failing
Date Wed, 24 Aug 2016 02:12:23 GMT
See https://builds.apache.org/job/ZooKeeper_branch35_solaris/220/

###################################################################################
########################## LAST 60 LINES OF THE CONSOLE ###########################
[...truncated 183 lines...]
[ivy:retrieve] 	found antlr#antlr;2.7.7 in maven2
[ivy:retrieve] 	found org.antlr#antlr4-runtime;4.5.1-1 in maven2
[ivy:retrieve] 	found commons-beanutils#commons-beanutils;1.9.2 in maven2
[ivy:retrieve] 	found commons-logging#commons-logging;1.1.1 in maven2
[ivy:retrieve] 	found commons-cli#commons-cli;1.3.1 in maven2
[ivy:retrieve] 	found com.google.guava#guava;18.0 in maven2
[ivy:retrieve] 	found commons-collections#commons-collections;3.2.2 in maven2
[ivy:retrieve] :: resolution report :: resolve 2580ms :: artifacts dl 12ms
[ivy:retrieve] 	:: evicted modules:
[ivy:retrieve] 	commons-collections#commons-collections;3.2.1 by [commons-collections#commons-collections;3.2.2]
in [test]
	---------------------------------------------------------------------
	|                  |            modules            ||   artifacts   |
	|       conf       | number| search|dwnlded|evicted|| number|dwnlded|
	---------------------------------------------------------------------
	|       test       |   13  |   0   |   0   |   1   ||   12  |   0   |
	---------------------------------------------------------------------
[ivy:retrieve] :: retrieving :: org.apache.zookeeper#zookeeper
[ivy:retrieve] 	confs: [test]
[ivy:retrieve] 	12 artifacts copied, 0 already retrieved (7025kB/2755ms)

compile-test:
    [mkdir] Created dir: /zonestorage/hudson_solaris/home/hudson/hudson-slave/workspace/ZooKeeper_branch35_solaris/branch-3.5/build/test/classes
    [javac] Compiling 191 source files to /zonestorage/hudson_solaris/home/hudson/hudson-slave/workspace/ZooKeeper_branch35_solaris/branch-3.5/build/test/classes
    [javac] Note: Some input files use or override a deprecated API.
    [javac] Note: Recompile with -Xlint:deprecation for details.
    [javac] Note: Some input files use unchecked or unsafe operations.
    [javac] Note: Recompile with -Xlint:unchecked for details.
    [javac] Compiling 11 source files to /zonestorage/hudson_solaris/home/hudson/hudson-slave/workspace/ZooKeeper_branch35_solaris/branch-3.5/build/test/classes

test-init:
    [mkdir] Created dir: /zonestorage/hudson_solaris/home/hudson/hudson-slave/workspace/ZooKeeper_branch35_solaris/branch-3.5/build/test/logs
    [mkdir] Created dir: /zonestorage/hudson_solaris/home/hudson/hudson-slave/workspace/ZooKeeper_branch35_solaris/branch-3.5/build/test/tmp
    [mkdir] Created dir: /zonestorage/hudson_solaris/home/hudson/hudson-slave/workspace/ZooKeeper_branch35_solaris/branch-3.5/build/test/data
    [mkdir] Created dir: /zonestorage/hudson_solaris/home/hudson/hudson-slave/workspace/ZooKeeper_branch35_solaris/branch-3.5/build/test/data/invalidsnap
     [copy] Copying 8 files to /zonestorage/hudson_solaris/home/hudson/hudson-slave/workspace/ZooKeeper_branch35_solaris/branch-3.5/build/test/data/invalidsnap
    [mkdir] Created dir: /zonestorage/hudson_solaris/home/hudson/hudson-slave/workspace/ZooKeeper_branch35_solaris/branch-3.5/build/test/data/buffersize
     [copy] Copying 7 files to /zonestorage/hudson_solaris/home/hudson/hudson-slave/workspace/ZooKeeper_branch35_solaris/branch-3.5/build/test/data/buffersize
    [mkdir] Created dir: /zonestorage/hudson_solaris/home/hudson/hudson-slave/workspace/ZooKeeper_branch35_solaris/branch-3.5/build/test/data/ssl
     [copy] Copying 3 files to /zonestorage/hudson_solaris/home/hudson/hudson-slave/workspace/ZooKeeper_branch35_solaris/branch-3.5/build/test/data/ssl

test-category:

junit-init:

junit.run-single:
     [echo] Running single JUnit process.  Upgrade to Ant 1.9.4 or later to run multiple JUnit
processes.
    [junit] Running org.apache.jute.BinaryInputArchiveTest
    [junit] Tests run: 1, Failures: 0, Errors: 1, Time elapsed: 0 sec

BUILD FAILED
/zonestorage/hudson_solaris/home/hudson/hudson-slave/workspace/ZooKeeper_branch35_solaris/branch-3.5/build.xml:1219:
Process fork failed.

Total time: 6 minutes 43 seconds
Build step 'Invoke Ant' marked build as failure
[locks-and-latches] Releasing all the locks
[locks-and-latches] All the locks released
Recording test results
Email was triggered for: Failure - Any
Sending email for trigger: Failure - Any



###################################################################################
############################## FAILED TESTS (if any) ##############################
1 tests failed.
FAILED:  org.apache.jute.BinaryInputArchiveTest.unknown

Error Message:
Forked Java VM exited abnormally. Please note the time in the report does not reflect the
time until the VM exit.

Stack Trace:
junit.framework.AssertionFailedError: Forked Java VM exited abnormally. Please note the time
in the report does not reflect the time until the VM exit.



Mime
  • Unnamed multipart/mixed (inline, None, 0 bytes)
View raw message