zookeeper-dev mailing list archives

Site index · List index
Message view « Date » · « Thread »
Top « Date » · « Thread »
From Apache Jenkins Server <jenk...@builds.apache.org>
Subject ZooKeeper_branch35_jdk7 - Build # 614 - Failure
Date Sun, 07 Aug 2016 08:56:31 GMT
See https://builds.apache.org/job/ZooKeeper_branch35_jdk7/614/

###################################################################################
########################## LAST 60 LINES OF THE CONSOLE ###########################
[...truncated 431575 lines...]
     [exec]  : elapsed 1000 : OK
     [exec] Zookeeper_simpleSystem::testLogCallbackClearLog Message Received: [2016-08-07
08:53:33,382:365(0x2ba8ced0e540):ZOO_INFO@log_env@1027: Client environment:zookeeper.version=zookeeper
C client 3.5.2]
     [exec] Log Message Received: [2016-08-07 08:53:33,382:365(0x2ba8ced0e540):ZOO_INFO@log_env@1031:
Client environment:host.name=pomona.apache.org]
     [exec] Log Message Received: [2016-08-07 08:53:33,382:365(0x2ba8ced0e540):ZOO_INFO@log_env@1038:
Client environment:os.name=Linux]
     [exec] Log Message Received: [2016-08-07 08:53:33,382:365(0x2ba8ced0e540):ZOO_INFO@log_env@1039:
Client environment:os.arch=3.13.0-36-lowlatency]
     [exec] Log Message Received: [2016-08-07 08:53:33,382:365(0x2ba8ced0e540):ZOO_INFO@log_env@1040:
Client environment:os.version=#63-Ubuntu SMP PREEMPT Wed Sep 3 21:56:12 UTC 2014]
     [exec] Log Message Received: [2016-08-07 08:53:33,382:365(0x2ba8ced0e540):ZOO_INFO@log_env@1048:
Client environment:user.name=jenkins]
     [exec] Log Message Received: [2016-08-07 08:53:33,382:365(0x2ba8ced0e540):ZOO_INFO@log_env@1056:
Client environment:user.home=/home/jenkins]
     [exec] Log Message Received: [2016-08-07 08:53:33,382:365(0x2ba8ced0e540):ZOO_INFO@log_env@1068:
Client environment:user.dir=/home/jenkins/jenkins-slave/workspace/ZooKeeper_branch35_jdk7/branch-3.5/build/test/test-cppunit]
     [exec] Log Message Received: [2016-08-07 08:53:33,382:365(0x2ba8ced0e540):ZOO_INFO@zookeeper_init_internal@1111:
Initiating client connection, host=127.0.0.1:22181 sessionTimeout=10000 watcher=0x45d2a0 sessionId=0
sessionPasswd=<null> context=0x7ffff6d50610 flags=0]
     [exec] Log Message Received: [2016-08-07 08:53:33,383:365(0x2ba8d0d6b700):ZOO_INFO@check_events@2357:
initiated connection to server [127.0.0.1:22181]]
     [exec] Log Message Received: [2016-08-07 08:53:33,387:365(0x2ba8d0d6b700):ZOO_INFO@check_events@2409:
session establishment complete on server [127.0.0.1:22181], sessionId=0x10992d8f195000e, negotiated
timeout=10000 ]
     [exec]  : elapsed 1002 : OK
     [exec] Zookeeper_simpleSystem::testAsyncWatcherAutoReset ZooKeeper server started : elapsed
9976 : OK
     [exec] Zookeeper_simpleSystem::testDeserializeString : elapsed 0 : OK
     [exec] Zookeeper_simpleSystem::testFirstServerDown : elapsed 1003 : OK
     [exec] Zookeeper_simpleSystem::testNullData : elapsed 1075 : OK
     [exec] Zookeeper_simpleSystem::testIPV6 : elapsed 1007 : OK
     [exec] Zookeeper_simpleSystem::testCreate : elapsed 1008 : OK
     [exec] Zookeeper_simpleSystem::testPath : elapsed 1023 : OK
     [exec] Zookeeper_simpleSystem::testPathValidation : elapsed 1047 : OK
     [exec] Zookeeper_simpleSystem::testPing : elapsed 17180 : OK
     [exec] Zookeeper_simpleSystem::testAcl : elapsed 1016 : OK
     [exec] Zookeeper_simpleSystem::testChroot : elapsed 4074 : OK
     [exec] Zookeeper_simpleSystem::testAuth ZooKeeper server started ZooKeeper server started
: elapsed 30189 : OK
     [exec] Zookeeper_simpleSystem::testHangingClient : elapsed 1025 : OK
     [exec] Zookeeper_simpleSystem::testWatcherAutoResetWithGlobal ZooKeeper server started
ZooKeeper server started ZooKeeper server started : elapsed 13853 : OK
     [exec] Zookeeper_simpleSystem::testWatcherAutoResetWithLocal ZooKeeper server started
ZooKeeper server started ZooKeeper server started : elapsed 14367 : OK
     [exec] Zookeeper_simpleSystem::testGetChildren2 : elapsed 1082 : OK
     [exec] Zookeeper_simpleSystem::testLastZxid : elapsed 4518 : OK
     [exec] Zookeeper_simpleSystem::testRemoveWatchers ZooKeeper server started : elapsed
3263 : OK
     [exec] Zookeeper_readOnly::testReadOnly : elapsed 4369 : OK
     [exec] OK (72)
     [exec] *** Error in `./zktest-mt': corrupted double-linked list: 0x0000000000a131b0 ***
     [exec] /bin/bash: line 5:   365 Aborted                 ZKROOT=/home/jenkins/jenkins-slave/workspace/ZooKeeper_branch35_jdk7/branch-3.5/src/c/../..
CLASSPATH=$CLASSPATH:$CLOVER_HOME/lib/clover.jar ${dir}$tst
     [exec] FAIL: zktest-mt
     [exec] ==========================================
     [exec] 1 of 2 tests failed
     [exec] Please report to user@zookeeper.apache.org
     [exec] ==========================================
     [exec] make[1]: Leaving directory `/home/jenkins/jenkins-slave/workspace/ZooKeeper_branch35_jdk7/branch-3.5/build/test/test-cppunit'
     [exec] make[1]: *** [check-TESTS] Error 1
     [exec] make: *** [check-am] Error 2

BUILD FAILED
/home/jenkins/jenkins-slave/workspace/ZooKeeper_branch35_jdk7/branch-3.5/build.xml:1322: The
following error occurred while executing this line:
/home/jenkins/jenkins-slave/workspace/ZooKeeper_branch35_jdk7/branch-3.5/build.xml:1282: The
following error occurred while executing this line:
/home/jenkins/jenkins-slave/workspace/ZooKeeper_branch35_jdk7/branch-3.5/build.xml:1292: exec
returned: 2

Total time: 17 minutes 53 seconds
Build step 'Invoke Ant' marked build as failure
Archiving artifacts
Setting JDK_1_7_LATEST__HOME=/home/jenkins/tools/java/latest1.7
Recording test results
Setting JDK_1_7_LATEST__HOME=/home/jenkins/tools/java/latest1.7
Email was triggered for: Failure - Any
Sending email for trigger: Failure - Any
Setting JDK_1_7_LATEST__HOME=/home/jenkins/tools/java/latest1.7
Setting JDK_1_7_LATEST__HOME=/home/jenkins/tools/java/latest1.7



###################################################################################
############################## FAILED TESTS (if any) ##############################
All tests passed
Mime
  • Unnamed multipart/mixed (inline, None, 0 bytes)
View raw message