zookeeper-dev mailing list archives

Site index · List index
Message view « Date » · « Thread »
Top « Date » · « Thread »
From Apache Jenkins Server <jenk...@builds.apache.org>
Subject ZooKeeper-trunk-solaris - Build # 1270 - Still Failing
Date Sun, 14 Aug 2016 07:31:02 GMT
See https://builds.apache.org/job/ZooKeeper-trunk-solaris/1270/

###################################################################################
########################## LAST 60 LINES OF THE CONSOLE ###########################
[...truncated 11304 lines...]
    [junit] 2016-08-14 07:32:07,753 [myid:] - INFO  [Time-limited test:Environment@109] -
Client environment:os.name=SunOS
    [junit] 2016-08-14 07:32:07,753 [myid:] - INFO  [Time-limited test:Environment@109] -
Client environment:os.arch=x86
    [junit] 2016-08-14 07:32:07,754 [myid:] - INFO  [Time-limited test:Environment@109] -
Client environment:os.version=5.10
    [junit] 2016-08-14 07:32:07,754 [myid:] - INFO  [Time-limited test:Environment@109] -
Client environment:user.name=hudson
    [junit] 2016-08-14 07:32:07,754 [myid:] - INFO  [Time-limited test:Environment@109] -
Client environment:user.home=/export/home/hudson
    [junit] 2016-08-14 07:32:07,754 [myid:] - INFO  [Time-limited test:Environment@109] -
Client environment:user.dir=/zonestorage/hudson_solaris/home/hudson/hudson-slave/workspace/ZooKeeper-trunk-solaris/trunk/build/test
    [junit] 2016-08-14 07:32:07,754 [myid:] - INFO  [Time-limited test:Environment@109] -
Client environment:os.memory.free=44MB
    [junit] 2016-08-14 07:32:07,755 [myid:] - INFO  [Time-limited test:Environment@109] -
Client environment:os.memory.max=454MB
    [junit] 2016-08-14 07:32:07,755 [myid:] - INFO  [Time-limited test:Environment@109] -
Client environment:os.memory.total=61MB
    [junit] 2016-08-14 07:32:08,177 [myid:] - INFO  [Time-limited test:ZooKeeper@855] - Initiating
client connection, connectString=127.0.0.1:11222 sessionTimeout=30000 watcher=org.apache.zookeeper.test.ClientBase$CountdownWatcher@5de953
    [junit] 2016-08-14 07:32:09,740 [myid:127.0.0.1:11222] - INFO  [Time-limited test-SendThread(127.0.0.1:11222):ClientCnxn$SendThread@1113]
- Opening socket connection to server 127.0.0.1/127.0.0.1:11222. Will not attempt to authenticate
using SASL (unknown error)
    [junit] 2016-08-14 07:32:09,741 [myid:127.0.0.1:11222] - INFO  [Time-limited test-SendThread(127.0.0.1:11222):ClientCnxn$SendThread@948]
- Socket connection established, initiating session, client: null, server: null
    [junit] 2016-08-14 07:32:09,971 [myid:] - INFO  [New I/O worker #2:ZooKeeperServer@995]
- Client attempting to establish new session at /127.0.0.1:55092
    [junit] 2016-08-14 07:32:10,030 [myid:] - INFO  [SyncThread:0:FileTxnLog@204] - Creating
new log file: log.1
    [junit] 2016-08-14 07:32:10,150 [myid:] - INFO  [SyncThread:0:ZooKeeperServer@709] - Established
session 0x12304f2d1330000 with negotiated timeout 30000 for client /127.0.0.1:55092
    [junit] 2016-08-14 07:32:10,150 [myid:127.0.0.1:11222] - INFO  [Time-limited test-SendThread(127.0.0.1:11222):ClientCnxn$SendThread@1381]
- Session establishment complete on server null, sessionid = 0x12304f2d1330000, negotiated
timeout = 30000
    [junit] 2016-08-14 07:32:10,478 [myid:] - INFO  [Time-limited test:JMXEnv@117] - expect:0x12304f2d1330000
    [junit] 2016-08-14 07:32:10,478 [myid:] - INFO  [Time-limited test:JMXEnv@120] - found:0x12304f2d1330000
org.apache.ZooKeeperService:name0=StandaloneServer_port11222,name1=Connections,name2=127.0.0.1,name3=0x12304f2d1330000
    [junit] 2016-08-14 07:32:10,771 [myid:127.0.0.1:11222] - INFO  [Time-limited test-SendThread(127.0.0.1:11222):ClientCnxn$SendThread@1231]
- Unable to read additional data from server sessionid 0x12304f2d1330000, likely server has
closed socket, closing socket connection and attempting reconnect
    [junit] 2016-08-14 07:32:10,776 [myid:] - INFO  [Time-limited test:MBeanRegistry@128]
- Unregister MBean [org.apache.ZooKeeperService:name0=StandaloneServer_port11222,name1=Connections,name2=127.0.0.1,name3=0x12304f2d1330000]
    [junit] 2016-08-14 07:32:10,777 [myid:] - INFO  [Time-limited test:NettyServerCnxnTest@74]
- Waiting for the channel disconnected event
    [junit] 2016-08-14 07:32:10,984 [myid:] - INFO  [Time-limited test:ZooKeeper@1313] - Session:
0x12304f2d1330000 closed
    [junit] 2016-08-14 07:32:10,984 [myid:] - INFO  [Time-limited test-EventThread:ClientCnxn$EventThread@513]
- EventThread shut down for session: 0x12304f2d1330000
    [junit] 2016-08-14 07:32:10,985 [myid:] - INFO  [Time-limited test:JUnit4ZKTestRunner$LoggedInvokeMethod@82]
- Memory used 19869
    [junit] 2016-08-14 07:32:10,985 [myid:] - INFO  [Time-limited test:JUnit4ZKTestRunner$LoggedInvokeMethod@87]
- Number of threads 35
    [junit] 2016-08-14 07:32:10,985 [myid:] - INFO  [Time-limited test:JUnit4ZKTestRunner$LoggedInvokeMethod@102]
- FINISHED TEST METHOD testSendCloseSession
    [junit] 2016-08-14 07:32:10,985 [myid:] - INFO  [main:ClientBase@543] - tearDown starting
    [junit] 2016-08-14 07:32:11,041 [myid:] - INFO  [main:ClientBase@513] - STOPPING server
    [junit] 2016-08-14 07:32:11,044 [myid:] - INFO  [main:NettyServerCnxnFactory@464] - shutdown
called 0.0.0.0/0.0.0.0:11222
    [junit] 2016-08-14 07:32:11,074 [myid:] - INFO  [main:ZooKeeperServer@529] - shutting
down
    [junit] 2016-08-14 07:32:11,075 [myid:] - ERROR [main:ZooKeeperServer@501] - ZKShutdownHandler
is not registered, so ZooKeeper server won't take any action on ERROR or SHUTDOWN server state
changes
    [junit] 2016-08-14 07:32:11,075 [myid:] - INFO  [main:SessionTrackerImpl@232] - Shutting
down
    [junit] 2016-08-14 07:32:11,075 [myid:] - INFO  [main:PrepRequestProcessor@965] - Shutting
down
    [junit] 2016-08-14 07:32:11,075 [myid:] - INFO  [main:SyncRequestProcessor@191] - Shutting
down
    [junit] 2016-08-14 07:32:11,075 [myid:] - INFO  [ProcessThread(sid:0 cport:11222)::PrepRequestProcessor@154]
- PrepRequestProcessor exited loop!
    [junit] 2016-08-14 07:32:11,075 [myid:] - INFO  [SyncThread:0:SyncRequestProcessor@169]
- SyncRequestProcessor exited!
    [junit] 2016-08-14 07:32:11,076 [myid:] - INFO  [main:FinalRequestProcessor@479] - shutdown
of request processor complete
    [junit] 2016-08-14 07:32:11,076 [myid:] - INFO  [main:MBeanRegistry@128] - Unregister
MBean [org.apache.ZooKeeperService:name0=StandaloneServer_port11222,name1=InMemoryDataTree]
    [junit] 2016-08-14 07:32:11,076 [myid:] - INFO  [main:MBeanRegistry@128] - Unregister
MBean [org.apache.ZooKeeperService:name0=StandaloneServer_port11222]
    [junit] 2016-08-14 07:32:11,077 [myid:] - INFO  [main:FourLetterWordMain@85] - connecting
to 127.0.0.1 11222
    [junit] 2016-08-14 07:32:11,078 [myid:] - INFO  [main:JMXEnv@146] - ensureOnly:[]
    [junit] 2016-08-14 07:32:11,493 [myid:] - INFO  [main:ClientBase@568] - fdcount after
test is: 52 at start it was 39
    [junit] 2016-08-14 07:32:11,494 [myid:] - INFO  [main:ClientBase@570] - sleeping for 20
secs
    [junit] 2016-08-14 07:32:11,507 [myid:] - INFO  [main:ZKTestCase$1@65] - SUCCEEDED testSendCloseSession
    [junit] 2016-08-14 07:32:11,507 [myid:] - INFO  [main:ZKTestCase$1@60] - FINISHED testSendCloseSession
    [junit] Tests run: 1, Failures: 0, Errors: 0, Time elapsed: 20.169 sec
    [junit] Running org.apache.zookeeper.server.PrepRequestProcessorTest
    [junit] Tests run: 1, Failures: 0, Errors: 1, Time elapsed: 0 sec

BUILD FAILED
/zonestorage/hudson_solaris/home/hudson/hudson-slave/workspace/ZooKeeper-trunk-solaris/trunk/build.xml:1219:
Process fork failed.

Total time: 14 minutes 21 seconds
Build step 'Invoke Ant' marked build as failure
[locks-and-latches] Releasing all the locks
[locks-and-latches] All the locks released
Recording test results
Email was triggered for: Failure - Any
Sending email for trigger: Failure - Any



###################################################################################
############################## FAILED TESTS (if any) ##############################
1 tests failed.
FAILED:  org.apache.zookeeper.server.PrepRequestProcessorTest.unknown

Error Message:
Forked Java VM exited abnormally. Please note the time in the report does not reflect the
time until the VM exit.

Stack Trace:
junit.framework.AssertionFailedError: Forked Java VM exited abnormally. Please note the time
in the report does not reflect the time until the VM exit.



Mime
  • Unnamed multipart/mixed (inline, None, 0 bytes)
View raw message