zookeeper-dev mailing list archives

Site index · List index
Message view « Date » · « Thread »
Top « Date » · « Thread »
From Apache Jenkins Server <jenk...@builds.apache.org>
Subject ZooKeeper-trunk-jdk8 - Build # 692 - Still Failing
Date Wed, 03 Aug 2016 12:42:47 GMT
See https://builds.apache.org/job/ZooKeeper-trunk-jdk8/692/

###################################################################################
########################## LAST 60 LINES OF THE CONSOLE ###########################
[...truncated 446030 lines...]
    [junit] 2016-08-03 12:42:34,616 [myid:] - INFO  [main:ClientBase@466] - STARTING server
    [junit] 2016-08-03 12:42:34,616 [myid:] - INFO  [main:ClientBase@386] - CREATING server
instance 127.0.0.1:11222
    [junit] 2016-08-03 12:42:34,616 [myid:] - INFO  [main:NIOServerCnxnFactory@673] - Configuring
NIO connection handler with 10s sessionless connection timeout, 1 selector thread(s), 8 worker
threads, and 64 kB direct buffers.
    [junit] 2016-08-03 12:42:34,617 [myid:] - INFO  [main:NIOServerCnxnFactory@686] - binding
to port 0.0.0.0/0.0.0.0:11222
    [junit] 2016-08-03 12:42:34,617 [myid:] - INFO  [main:ClientBase@361] - STARTING server
instance 127.0.0.1:11222
    [junit] 2016-08-03 12:42:34,618 [myid:] - INFO  [main:ZooKeeperServer@858] - minSessionTimeout
set to 6000
    [junit] 2016-08-03 12:42:34,618 [myid:] - INFO  [main:ZooKeeperServer@867] - maxSessionTimeout
set to 60000
    [junit] 2016-08-03 12:42:34,618 [myid:] - INFO  [main:ZooKeeperServer@156] - Created server
with tickTime 3000 minSessionTimeout 6000 maxSessionTimeout 60000 datadir /home/jenkins/jenkins-slave/workspace/ZooKeeper-trunk-jdk8/trunk/build/test/tmp/test210825065047877411.junit.dir/version-2
snapdir /home/jenkins/jenkins-slave/workspace/ZooKeeper-trunk-jdk8/trunk/build/test/tmp/test210825065047877411.junit.dir/version-2
    [junit] 2016-08-03 12:42:34,622 [myid:] - INFO  [main:FileSnap@83] - Reading snapshot
/home/jenkins/jenkins-slave/workspace/ZooKeeper-trunk-jdk8/trunk/build/test/tmp/test210825065047877411.junit.dir/version-2/snapshot.b
    [junit] 2016-08-03 12:42:34,624 [myid:] - INFO  [main:FileTxnSnapLog@298] - Snapshotting:
0xb to /home/jenkins/jenkins-slave/workspace/ZooKeeper-trunk-jdk8/trunk/build/test/tmp/test210825065047877411.junit.dir/version-2/snapshot.b
    [junit] 2016-08-03 12:42:34,627 [myid:] - INFO  [main:FourLetterWordMain@85] - connecting
to 127.0.0.1 11222
    [junit] 2016-08-03 12:42:34,628 [myid:] - INFO  [NIOServerCxnFactory.AcceptThread:0.0.0.0/0.0.0.0:11222:NIOServerCnxnFactory$AcceptThread@296]
- Accepted socket connection from /127.0.0.1:50082
    [junit] 2016-08-03 12:42:34,630 [myid:] - INFO  [NIOWorkerThread-1:NIOServerCnxn@485]
- Processing stat command from /127.0.0.1:50082
    [junit] 2016-08-03 12:42:34,630 [myid:] - INFO  [NIOWorkerThread-1:StatCommand@49] - Stat
command output
    [junit] 2016-08-03 12:42:34,630 [myid:] - INFO  [NIOWorkerThread-1:NIOServerCnxn@607]
- Closed socket connection for client /127.0.0.1:50082 (no session established for client)
    [junit] 2016-08-03 12:42:34,630 [myid:] - INFO  [main:JMXEnv@228] - ensureParent:[InMemoryDataTree,
StandaloneServer_port]
    [junit] 2016-08-03 12:42:34,633 [myid:] - INFO  [main:JMXEnv@245] - expect:InMemoryDataTree
    [junit] 2016-08-03 12:42:34,633 [myid:] - INFO  [main:JMXEnv@249] - found:InMemoryDataTree
org.apache.ZooKeeperService:name0=StandaloneServer_port11222,name1=InMemoryDataTree
    [junit] 2016-08-03 12:42:34,633 [myid:] - INFO  [main:JMXEnv@245] - expect:StandaloneServer_port
    [junit] 2016-08-03 12:42:34,633 [myid:] - INFO  [main:JMXEnv@249] - found:StandaloneServer_port
org.apache.ZooKeeperService:name0=StandaloneServer_port11222
    [junit] 2016-08-03 12:42:34,634 [myid:] - INFO  [main:JUnit4ZKTestRunner$LoggedInvokeMethod@82]
- Memory used 5176
    [junit] 2016-08-03 12:42:34,634 [myid:] - INFO  [main:JUnit4ZKTestRunner$LoggedInvokeMethod@87]
- Number of threads 23
    [junit] 2016-08-03 12:42:34,634 [myid:] - INFO  [main:JUnit4ZKTestRunner$LoggedInvokeMethod@102]
- FINISHED TEST METHOD testQuota
    [junit] 2016-08-03 12:42:34,635 [myid:] - INFO  [main:ClientBase@543] - tearDown starting
    [junit] 2016-08-03 12:42:34,686 [myid:] - INFO  [main:ZooKeeper@1313] - Session: 0x100019e686f0000
closed
    [junit] 2016-08-03 12:42:34,687 [myid:] - INFO  [main:ClientBase@513] - STOPPING server
    [junit] 2016-08-03 12:42:34,686 [myid:] - INFO  [main-EventThread:ClientCnxn$EventThread@513]
- EventThread shut down for session: 0x100019e686f0000
    [junit] 2016-08-03 12:42:34,687 [myid:] - INFO  [ConnnectionExpirer:NIOServerCnxnFactory$ConnectionExpirerThread@583]
- ConnnectionExpirerThread interrupted
    [junit] 2016-08-03 12:42:34,687 [myid:] - INFO  [NIOServerCxnFactory.SelectorThread-0:NIOServerCnxnFactory$SelectorThread@420]
- selector thread exitted run method
    [junit] 2016-08-03 12:42:34,687 [myid:] - INFO  [NIOServerCxnFactory.AcceptThread:0.0.0.0/0.0.0.0:11222:NIOServerCnxnFactory$AcceptThread@219]
- accept thread exitted run method
    [junit] 2016-08-03 12:42:34,688 [myid:] - INFO  [main:ZooKeeperServer@498] - shutting
down
    [junit] 2016-08-03 12:42:34,688 [myid:] - INFO  [main:SessionTrackerImpl@232] - Shutting
down
    [junit] 2016-08-03 12:42:34,689 [myid:] - INFO  [main:PrepRequestProcessor@965] - Shutting
down
    [junit] 2016-08-03 12:42:34,689 [myid:] - INFO  [main:SyncRequestProcessor@191] - Shutting
down
    [junit] 2016-08-03 12:42:34,689 [myid:] - INFO  [ProcessThread(sid:0 cport:11222)::PrepRequestProcessor@154]
- PrepRequestProcessor exited loop!
    [junit] 2016-08-03 12:42:34,689 [myid:] - INFO  [SyncThread:0:SyncRequestProcessor@169]
- SyncRequestProcessor exited!
    [junit] 2016-08-03 12:42:34,689 [myid:] - INFO  [main:FinalRequestProcessor@479] - shutdown
of request processor complete
    [junit] 2016-08-03 12:42:34,690 [myid:] - INFO  [main:MBeanRegistry@128] - Unregister
MBean [org.apache.ZooKeeperService:name0=StandaloneServer_port11222,name1=InMemoryDataTree]
    [junit] 2016-08-03 12:42:34,690 [myid:] - INFO  [main:MBeanRegistry@128] - Unregister
MBean [org.apache.ZooKeeperService:name0=StandaloneServer_port11222]
    [junit] 2016-08-03 12:42:34,691 [myid:] - INFO  [main:FourLetterWordMain@85] - connecting
to 127.0.0.1 11222
    [junit] 2016-08-03 12:42:34,691 [myid:] - INFO  [main:JMXEnv@146] - ensureOnly:[]
    [junit] 2016-08-03 12:42:34,698 [myid:] - INFO  [main:ClientBase@568] - fdcount after
test is: 52 at start it was 37
    [junit] 2016-08-03 12:42:34,698 [myid:] - INFO  [main:ClientBase@570] - sleeping for 20
secs
    [junit] 2016-08-03 12:42:34,699 [myid:] - INFO  [main:ZKTestCase$1@65] - SUCCEEDED testQuota
    [junit] 2016-08-03 12:42:34,700 [myid:] - INFO  [main:ZKTestCase$1@60] - FINISHED testQuota
    [junit] Tests run: 1, Failures: 0, Errors: 0, Time elapsed: 0.674 sec
    [junit] 2016-08-03 12:42:34,713 [myid:] - INFO  [SessionTracker:SessionTrackerImpl@158]
- SessionTrackerImpl exited loop!
    [junit] 2016-08-03 12:42:34,714 [myid:] - INFO  [SessionTracker:SessionTrackerImpl@158]
- SessionTrackerImpl exited loop!
    [junit] 2016-08-03 12:42:34,714 [myid:] - INFO  [SessionTracker:SessionTrackerImpl@158]
- SessionTrackerImpl exited loop!

BUILD FAILED
/home/jenkins/jenkins-slave/workspace/ZooKeeper-trunk-jdk8/trunk/build.xml:1233: Tests failed!

Total time: 57 minutes 8 seconds
Build step 'Invoke Ant' marked build as failure
[WARNINGS] Skipping publisher since build result is FAILURE
Recording test results
Email was triggered for: Failure - Any
Sending email for trigger: Failure - Any



###################################################################################
############################## FAILED TESTS (if any) ##############################
1 tests failed.
FAILED:  org.apache.zookeeper.server.quorum.RaceConditionTest.testRaceConditionBetweenLeaderAndAckRequestProcessor

Error Message:
Leader failed to transition to LOOKING or FOLLOWING state

Stack Trace:
junit.framework.AssertionFailedError: Leader failed to transition to LOOKING or FOLLOWING
state
	at org.apache.zookeeper.server.quorum.RaceConditionTest.testRaceConditionBetweenLeaderAndAckRequestProcessor(RaceConditionTest.java:74)
	at org.apache.zookeeper.JUnit4ZKTestRunner$LoggedInvokeMethod.evaluate(JUnit4ZKTestRunner.java:79)
	at java.util.concurrent.FutureTask.run(FutureTask.java:266)
	at java.lang.Thread.run(Thread.java:744)



Mime
  • Unnamed multipart/mixed (inline, None, 0 bytes)
View raw message