zookeeper-dev mailing list archives

Site index · List index
Message view « Date » · « Thread »
Top « Date » · « Thread »
From Apache Jenkins Server <jenk...@builds.apache.org>
Subject ZooKeeper_branch35_solaris - Build # 209 - Still Failing
Date Sat, 13 Aug 2016 18:29:36 GMT
See https://builds.apache.org/job/ZooKeeper_branch35_solaris/209/

###################################################################################
########################## LAST 60 LINES OF THE CONSOLE ###########################
[...truncated 12404 lines...]
    [junit] Removing file: Aug 13, 2016 6:30:52 PM	/zonestorage/hudson_solaris/home/hudson/hudson-slave/workspace/ZooKeeper_branch35_solaris/branch-3.5/build/test/tmp/test1796438771629162171.junit.dir/version-2/log.3
    [junit] Removing file: Aug 13, 2016 6:30:52 PM	/zonestorage/hudson_solaris/home/hudson/hudson-slave/workspace/ZooKeeper_branch35_solaris/branch-3.5/build/test/tmp/test1796438771629162171.junit.dir/version-2/snapshot.2
    [junit] Removing file: Aug 13, 2016 6:30:52 PM	/zonestorage/hudson_solaris/home/hudson/hudson-slave/workspace/ZooKeeper_branch35_solaris/branch-3.5/build/test/tmp/test1796438771629162171.junit.dir/version-2/snapshot.0
    [junit] 2016-08-13 18:30:52,951 [myid:] - INFO  [main:JUnit4ZKTestRunner$LoggedInvokeMethod@82]
- Memory used 7478
    [junit] 2016-08-13 18:30:52,951 [myid:] - INFO  [main:JUnit4ZKTestRunner$LoggedInvokeMethod@87]
- Number of threads 4
    [junit] 2016-08-13 18:30:52,951 [myid:] - INFO  [main:JUnit4ZKTestRunner$LoggedInvokeMethod@102]
- FINISHED TEST METHOD testSnapFilesLessThanToRetain
    [junit] 2016-08-13 18:30:53,184 [myid:] - INFO  [main:ZKTestCase$1@65] - SUCCEEDED testSnapFilesLessThanToRetain
    [junit] 2016-08-13 18:30:53,184 [myid:] - INFO  [main:ZKTestCase$1@60] - FINISHED testSnapFilesLessThanToRetain
    [junit] 2016-08-13 18:30:53,185 [myid:] - INFO  [main:ZKTestCase$1@55] - STARTING testPurgeTxnLogWithDataDir
    [junit] 2016-08-13 18:30:53,185 [myid:] - INFO  [main:JUnit4ZKTestRunner$LoggedInvokeMethod@77]
- RUNNING TEST METHOD testPurgeTxnLogWithDataDir
    [junit] Removing file: Aug 13, 2016 6:30:53 PM	/zonestorage/hudson_solaris/home/hudson/hudson-slave/workspace/ZooKeeper_branch35_solaris/branch-3.5/build/test/tmp/test9080170508663014892.junit.dir/dataLogDir/version-2/log.2
    [junit] Removing file: Aug 13, 2016 6:30:53 PM	/zonestorage/hudson_solaris/home/hudson/hudson-slave/workspace/ZooKeeper_branch35_solaris/branch-3.5/build/test/tmp/test9080170508663014892.junit.dir/dataLogDir/version-2/log.8
    [junit] Removing file: Aug 13, 2016 6:30:53 PM	/zonestorage/hudson_solaris/home/hudson/hudson-slave/workspace/ZooKeeper_branch35_solaris/branch-3.5/build/test/tmp/test9080170508663014892.junit.dir/dataLogDir/version-2/log.5
    [junit] Removing file: Aug 13, 2016 6:30:53 PM	/zonestorage/hudson_solaris/home/hudson/hudson-slave/workspace/ZooKeeper_branch35_solaris/branch-3.5/build/test/tmp/test9080170508663014892.junit.dir/dataLogDir/version-2/log.1
    [junit] Removing file: Aug 13, 2016 6:30:53 PM	/zonestorage/hudson_solaris/home/hudson/hudson-slave/workspace/ZooKeeper_branch35_solaris/branch-3.5/build/test/tmp/test9080170508663014892.junit.dir/dataLogDir/version-2/log.6
    [junit] Removing file: Aug 13, 2016 6:30:53 PM	/zonestorage/hudson_solaris/home/hudson/hudson-slave/workspace/ZooKeeper_branch35_solaris/branch-3.5/build/test/tmp/test9080170508663014892.junit.dir/dataLogDir/version-2/log.4
    [junit] Removing file: Aug 13, 2016 6:30:53 PM	/zonestorage/hudson_solaris/home/hudson/hudson-slave/workspace/ZooKeeper_branch35_solaris/branch-3.5/build/test/tmp/test9080170508663014892.junit.dir/dataLogDir/version-2/log.9
    [junit] Removing file: Aug 13, 2016 6:30:53 PM	/zonestorage/hudson_solaris/home/hudson/hudson-slave/workspace/ZooKeeper_branch35_solaris/branch-3.5/build/test/tmp/test9080170508663014892.junit.dir/dataLogDir/version-2/log.3
    [junit] Removing file: Aug 13, 2016 6:30:53 PM	/zonestorage/hudson_solaris/home/hudson/hudson-slave/workspace/ZooKeeper_branch35_solaris/branch-3.5/build/test/tmp/test9080170508663014892.junit.dir/dataLogDir/version-2/log.7
    [junit] Removing file: Aug 13, 2016 6:30:53 PM	/zonestorage/hudson_solaris/home/hudson/hudson-slave/workspace/ZooKeeper_branch35_solaris/branch-3.5/build/test/tmp/test9080170508663014892.junit.dir/dataLogDir/version-2/log.0
    [junit] Removing file: Aug 13, 2016 6:30:53 PM	/zonestorage/hudson_solaris/home/hudson/hudson-slave/workspace/ZooKeeper_branch35_solaris/branch-3.5/build/test/tmp/test9080170508663014892.junit.dir/dataDir/version-2/snapshot.0
    [junit] Removing file: Aug 13, 2016 6:30:53 PM	/zonestorage/hudson_solaris/home/hudson/hudson-slave/workspace/ZooKeeper_branch35_solaris/branch-3.5/build/test/tmp/test9080170508663014892.junit.dir/dataDir/version-2/snapshot.7
    [junit] Removing file: Aug 13, 2016 6:30:53 PM	/zonestorage/hudson_solaris/home/hudson/hudson-slave/workspace/ZooKeeper_branch35_solaris/branch-3.5/build/test/tmp/test9080170508663014892.junit.dir/dataDir/version-2/snapshot.9
    [junit] Removing file: Aug 13, 2016 6:30:53 PM	/zonestorage/hudson_solaris/home/hudson/hudson-slave/workspace/ZooKeeper_branch35_solaris/branch-3.5/build/test/tmp/test9080170508663014892.junit.dir/dataDir/version-2/snapshot.3
    [junit] Removing file: Aug 13, 2016 6:30:53 PM	/zonestorage/hudson_solaris/home/hudson/hudson-slave/workspace/ZooKeeper_branch35_solaris/branch-3.5/build/test/tmp/test9080170508663014892.junit.dir/dataDir/version-2/snapshot.4
    [junit] Removing file: Aug 13, 2016 6:30:53 PM	/zonestorage/hudson_solaris/home/hudson/hudson-slave/workspace/ZooKeeper_branch35_solaris/branch-3.5/build/test/tmp/test9080170508663014892.junit.dir/dataDir/version-2/snapshot.6
    [junit] Removing file: Aug 13, 2016 6:30:53 PM	/zonestorage/hudson_solaris/home/hudson/hudson-slave/workspace/ZooKeeper_branch35_solaris/branch-3.5/build/test/tmp/test9080170508663014892.junit.dir/dataDir/version-2/snapshot.1
    [junit] Removing file: Aug 13, 2016 6:30:53 PM	/zonestorage/hudson_solaris/home/hudson/hudson-slave/workspace/ZooKeeper_branch35_solaris/branch-3.5/build/test/tmp/test9080170508663014892.junit.dir/dataDir/version-2/snapshot.5
    [junit] Removing file: Aug 13, 2016 6:30:53 PM	/zonestorage/hudson_solaris/home/hudson/hudson-slave/workspace/ZooKeeper_branch35_solaris/branch-3.5/build/test/tmp/test9080170508663014892.junit.dir/dataDir/version-2/snapshot.2
    [junit] Removing file: Aug 13, 2016 6:30:53 PM	/zonestorage/hudson_solaris/home/hudson/hudson-slave/workspace/ZooKeeper_branch35_solaris/branch-3.5/build/test/tmp/test9080170508663014892.junit.dir/dataDir/version-2/snapshot.8
    [junit] 2016-08-13 18:30:53,339 [myid:] - INFO  [main:JUnit4ZKTestRunner$LoggedInvokeMethod@82]
- Memory used 7906
    [junit] 2016-08-13 18:30:53,340 [myid:] - INFO  [main:JUnit4ZKTestRunner$LoggedInvokeMethod@87]
- Number of threads 4
    [junit] 2016-08-13 18:30:53,340 [myid:] - INFO  [main:JUnit4ZKTestRunner$LoggedInvokeMethod@102]
- FINISHED TEST METHOD testPurgeTxnLogWithDataDir
    [junit] 2016-08-13 18:30:53,340 [myid:] - INFO  [main:ZKTestCase$1@65] - SUCCEEDED testPurgeTxnLogWithDataDir
    [junit] 2016-08-13 18:30:53,340 [myid:] - INFO  [main:ZKTestCase$1@60] - FINISHED testPurgeTxnLogWithDataDir
    [junit] 2016-08-13 18:30:53,340 [myid:] - INFO  [main:ZKTestCase$1@55] - STARTING testFindNRecentSnapshots
    [junit] 2016-08-13 18:30:53,340 [myid:] - INFO  [main:JUnit4ZKTestRunner$LoggedInvokeMethod@77]
- RUNNING TEST METHOD testFindNRecentSnapshots
    [junit] 2016-08-13 18:30:53,346 [myid:] - INFO  [main:JUnit4ZKTestRunner$LoggedInvokeMethod@82]
- Memory used 8334
    [junit] 2016-08-13 18:30:53,346 [myid:] - INFO  [main:JUnit4ZKTestRunner$LoggedInvokeMethod@87]
- Number of threads 4
    [junit] 2016-08-13 18:30:53,346 [myid:] - INFO  [main:JUnit4ZKTestRunner$LoggedInvokeMethod@102]
- FINISHED TEST METHOD testFindNRecentSnapshots
    [junit] 2016-08-13 18:30:53,388 [myid:] - INFO  [main:ZKTestCase$1@65] - SUCCEEDED testFindNRecentSnapshots
    [junit] 2016-08-13 18:30:53,388 [myid:] - INFO  [main:ZKTestCase$1@60] - FINISHED testFindNRecentSnapshots
    [junit] Tests run: 8, Failures: 0, Errors: 0, Time elapsed: 44.838 sec
    [junit] Running org.apache.zookeeper.server.ReferenceCountedACLCacheTest
    [junit] 2016-08-13 18:31:05,795 [myid:] - INFO  [main:ReferenceCountedACLCache@155] -
Ignoring acl 1 as it does not exist in the cache
    [junit] Tests run: 10, Failures: 0, Errors: 0, Time elapsed: 4.236 sec
    [junit] Running org.apache.zookeeper.server.SerializationPerfTest
    [junit] Tests run: 1, Failures: 0, Errors: 1, Time elapsed: 0 sec

BUILD FAILED
/zonestorage/hudson_solaris/home/hudson/hudson-slave/workspace/ZooKeeper_branch35_solaris/branch-3.5/build.xml:1219:
Process fork failed.

Total time: 11 minutes 42 seconds
Build step 'Invoke Ant' marked build as failure
[locks-and-latches] Releasing all the locks
[locks-and-latches] All the locks released
Recording test results
Email was triggered for: Failure - Any
Sending email for trigger: Failure - Any



###################################################################################
############################## FAILED TESTS (if any) ##############################
1 tests failed.
FAILED:  org.apache.zookeeper.server.SerializationPerfTest.unknown

Error Message:
Forked Java VM exited abnormally. Please note the time in the report does not reflect the
time until the VM exit.

Stack Trace:
junit.framework.AssertionFailedError: Forked Java VM exited abnormally. Please note the time
in the report does not reflect the time until the VM exit.



Mime
  • Unnamed multipart/mixed (inline, None, 0 bytes)
View raw message