zookeeper-dev mailing list archives

Site index · List index
Message view « Date » · « Thread »
Top « Date » · « Thread »
From Apache Jenkins Server <jenk...@builds.apache.org>
Subject ZooKeeper_branch35_solaris - Build # 214 - Still Failing
Date Thu, 18 Aug 2016 16:59:09 GMT
See https://builds.apache.org/job/ZooKeeper_branch35_solaris/214/

###################################################################################
########################## LAST 60 LINES OF THE CONSOLE ###########################
[...truncated 180446 lines...]
    [junit] 2016-08-18 16:58:21,560 [myid:] - INFO  [main:Environment@109] - Client environment:java.io.tmpdir=/var/tmp/
    [junit] 2016-08-18 16:58:21,560 [myid:] - INFO  [main:Environment@109] - Client environment:java.compiler=<NA>
    [junit] 2016-08-18 16:58:21,560 [myid:] - INFO  [main:Environment@109] - Client environment:os.name=SunOS
    [junit] 2016-08-18 16:58:21,560 [myid:] - INFO  [main:Environment@109] - Client environment:os.arch=x86
    [junit] 2016-08-18 16:58:21,560 [myid:] - INFO  [main:Environment@109] - Client environment:os.version=5.10
    [junit] 2016-08-18 16:58:21,560 [myid:] - INFO  [main:Environment@109] - Client environment:user.name=hudson
    [junit] 2016-08-18 16:58:21,560 [myid:] - INFO  [main:Environment@109] - Client environment:user.home=/export/home/hudson
    [junit] 2016-08-18 16:58:21,560 [myid:] - INFO  [main:Environment@109] - Client environment:user.dir=/zonestorage/hudson_solaris/home/hudson/hudson-slave/workspace/ZooKeeper_branch35_solaris/branch-3.5/build/test
    [junit] 2016-08-18 16:58:21,561 [myid:] - INFO  [main:Environment@109] - Client environment:os.memory.free=68MB
    [junit] 2016-08-18 16:58:21,561 [myid:] - INFO  [main:Environment@109] - Client environment:os.memory.max=454MB
    [junit] 2016-08-18 16:58:21,561 [myid:] - INFO  [main:Environment@109] - Client environment:os.memory.total=77MB
    [junit] 2016-08-18 16:58:21,604 [myid:] - INFO  [main:ZooKeeper@855] - Initiating client
connection, connectString=127.0.0.1:11222 sessionTimeout=20000 watcher=org.apache.zookeeper.test.InvalidSnapshotTest@1f1ca93
    [junit] 2016-08-18 16:58:21,860 [myid:127.0.0.1:11222] - INFO  [main-SendThread(127.0.0.1:11222):ClientCnxn$SendThread@1113]
- Opening socket connection to server 127.0.0.1/127.0.0.1:11222. Will not attempt to authenticate
using SASL (unknown error)
    [junit] 2016-08-18 16:58:21,861 [myid:127.0.0.1:11222] - INFO  [main-SendThread(127.0.0.1:11222):ClientCnxn$SendThread@948]
- Socket connection established, initiating session, client: null, server: null
    [junit] 2016-08-18 16:58:21,861 [myid:] - INFO  [NIOServerCxnFactory.AcceptThread:0.0.0.0/0.0.0.0:11222:NIOServerCnxnFactory$AcceptThread@296]
- Accepted socket connection from /127.0.0.1:38356
    [junit] 2016-08-18 16:58:21,882 [myid:] - INFO  [NIOWorkerThread-2:ZooKeeperServer@995]
- Client attempting to establish new session at /127.0.0.1:38356
    [junit] 2016-08-18 16:58:21,890 [myid:] - INFO  [SyncThread:0:FileTxnLog@204] - Creating
new log file: log.840
    [junit] 2016-08-18 16:58:22,568 [myid:] - INFO  [SyncThread:0:ZooKeeperServer@709] - Established
session 0x1231b9294510000 with negotiated timeout 20000 for client /127.0.0.1:38356
    [junit] 2016-08-18 16:58:22,643 [myid:127.0.0.1:11222] - INFO  [main-SendThread(127.0.0.1:11222):ClientCnxn$SendThread@1381]
- Session establishment complete on server null, sessionid = 0x1231b9294510000, negotiated
timeout = 20000
    [junit] 2016-08-18 16:58:22,702 [myid:] - INFO  [main-EventThread:InvalidSnapshotTest@117]
- Event:SyncConnected None null
    [junit] 2016-08-18 16:58:22,808 [myid:] - INFO  [ProcessThread(sid:0 cport:11222)::PrepRequestProcessor@647]
- Processed session termination for sessionid: 0x1231b9294510000
    [junit] 2016-08-18 16:58:22,810 [myid:] - INFO  [main:ZooKeeper@1313] - Session: 0x1231b9294510000
closed
    [junit] 2016-08-18 16:58:22,810 [myid:] - INFO  [NIOWorkerThread-7:MBeanRegistry@128]
- Unregister MBean [org.apache.ZooKeeperService:name0=StandaloneServer_port11222,name1=Connections,name2=127.0.0.1,name3=0x1231b9294510000]
    [junit] 2016-08-18 16:58:22,811 [myid:] - INFO  [ConnnectionExpirer:NIOServerCnxnFactory$ConnectionExpirerThread@583]
- ConnnectionExpirerThread interrupted
    [junit] 2016-08-18 16:58:22,810 [myid:] - INFO  [main-EventThread:ClientCnxn$EventThread@513]
- EventThread shut down for session: 0x1231b9294510000
    [junit] 2016-08-18 16:58:22,811 [myid:] - INFO  [NIOWorkerThread-7:NIOServerCnxn@607]
- Closed socket connection for client /127.0.0.1:38356 which had sessionid 0x1231b9294510000
    [junit] 2016-08-18 16:58:22,811 [myid:] - INFO  [NIOServerCxnFactory.AcceptThread:0.0.0.0/0.0.0.0:11222:NIOServerCnxnFactory$AcceptThread@219]
- accept thread exitted run method
    [junit] 2016-08-18 16:58:22,812 [myid:] - INFO  [NIOServerCxnFactory.SelectorThread-0:NIOServerCnxnFactory$SelectorThread@420]
- selector thread exitted run method
    [junit] 2016-08-18 16:58:22,812 [myid:] - INFO  [NIOServerCxnFactory.SelectorThread-1:NIOServerCnxnFactory$SelectorThread@420]
- selector thread exitted run method
    [junit] 2016-08-18 16:58:22,813 [myid:] - INFO  [main:ZooKeeperServer@529] - shutting
down
    [junit] 2016-08-18 16:58:22,813 [myid:] - ERROR [main:ZooKeeperServer@501] - ZKShutdownHandler
is not registered, so ZooKeeper server won't take any action on ERROR or SHUTDOWN server state
changes
    [junit] 2016-08-18 16:58:22,813 [myid:] - INFO  [main:SessionTrackerImpl@232] - Shutting
down
    [junit] 2016-08-18 16:58:22,813 [myid:] - INFO  [main:PrepRequestProcessor@965] - Shutting
down
    [junit] 2016-08-18 16:58:22,813 [myid:] - INFO  [main:SyncRequestProcessor@191] - Shutting
down
    [junit] 2016-08-18 16:58:22,813 [myid:] - INFO  [ProcessThread(sid:0 cport:11222)::PrepRequestProcessor@154]
- PrepRequestProcessor exited loop!
    [junit] 2016-08-18 16:58:22,813 [myid:] - INFO  [SyncThread:0:SyncRequestProcessor@169]
- SyncRequestProcessor exited!
    [junit] 2016-08-18 16:58:22,814 [myid:] - INFO  [main:FinalRequestProcessor@479] - shutdown
of request processor complete
    [junit] 2016-08-18 16:58:22,814 [myid:] - INFO  [main:MBeanRegistry@128] - Unregister
MBean [org.apache.ZooKeeperService:name0=StandaloneServer_port11222,name1=InMemoryDataTree]
    [junit] 2016-08-18 16:58:22,814 [myid:] - INFO  [main:MBeanRegistry@128] - Unregister
MBean [org.apache.ZooKeeperService:name0=StandaloneServer_port11222]
    [junit] 2016-08-18 16:58:22,815 [myid:] - INFO  [main:FourLetterWordMain@85] - connecting
to 127.0.0.1 11222
    [junit] 2016-08-18 16:58:22,815 [myid:] - INFO  [main:JUnit4ZKTestRunner$LoggedInvokeMethod@82]
- Memory used 12589
    [junit] 2016-08-18 16:58:22,815 [myid:] - INFO  [main:JUnit4ZKTestRunner$LoggedInvokeMethod@87]
- Number of threads 6
    [junit] 2016-08-18 16:58:22,815 [myid:] - INFO  [main:JUnit4ZKTestRunner$LoggedInvokeMethod@102]
- FINISHED TEST METHOD testSnapshot
    [junit] 2016-08-18 16:58:22,815 [myid:] - INFO  [main:ZKTestCase$1@65] - SUCCEEDED testSnapshot
    [junit] 2016-08-18 16:58:22,816 [myid:] - INFO  [main:ZKTestCase$1@60] - FINISHED testSnapshot
    [junit] Tests run: 4, Failures: 0, Errors: 0, Time elapsed: 16.802 sec
    [junit] Running org.apache.zookeeper.test.KeeperStateTest
    [junit] Tests run: 1, Failures: 0, Errors: 1, Time elapsed: 0 sec

BUILD FAILED
/zonestorage/hudson_solaris/home/hudson/hudson-slave/workspace/ZooKeeper_branch35_solaris/branch-3.5/build.xml:1219:
Process fork failed.

Total time: 43 minutes 50 seconds
Build step 'Invoke Ant' marked build as failure
[locks-and-latches] Releasing all the locks
[locks-and-latches] All the locks released
Recording test results
Email was triggered for: Failure - Any
Sending email for trigger: Failure - Any



###################################################################################
############################## FAILED TESTS (if any) ##############################
1 tests failed.
FAILED:  org.apache.zookeeper.test.KeeperStateTest.unknown

Error Message:
Forked Java VM exited abnormally. Please note the time in the report does not reflect the
time until the VM exit.

Stack Trace:
junit.framework.AssertionFailedError: Forked Java VM exited abnormally. Please note the time
in the report does not reflect the time until the VM exit.



Mime
  • Unnamed multipart/mixed (inline, None, 0 bytes)
View raw message