zookeeper-dev mailing list archives

Site index · List index
Message view « Date » · « Thread »
Top « Date » · « Thread »
From Apache Jenkins Server <jenk...@builds.apache.org>
Subject ZooKeeper_branch35_solaris - Build # 161 - Still Failing
Date Tue, 05 Jul 2016 16:21:43 GMT
See https://builds.apache.org/job/ZooKeeper_branch35_solaris/161/

###################################################################################
########################## LAST 60 LINES OF THE CONSOLE ###########################
Started by timer
[EnvInject] - Loading node environment variables.
Building remotely on solaris1 (Solaris) in workspace /export/home/hudson/hudson-slave/workspace/ZooKeeper_branch35_solaris
Updating http://svn.apache.org/repos/asf/zookeeper/branches/branch-3.5 at revision '2016-07-05T16:06:21.948
+0000'
FATAL: java.io.IOException: Unexpected termination of the channel
hudson.remoting.RequestAbortedException: java.io.IOException: Unexpected termination of the
channel
	at hudson.remoting.Request.abort(Request.java:297)
	at hudson.remoting.Channel.terminate(Channel.java:847)
	at hudson.remoting.SynchronousCommandTransport$ReaderThread.run(SynchronousCommandTransport.java:69)
	at ......remote call to solaris1(Native Method)
	at hudson.remoting.Channel.attachCallSiteStackTrace(Channel.java:1416)
	at hudson.remoting.Request.call(Request.java:172)
	at hudson.remoting.Channel.call(Channel.java:780)
	at hudson.FilePath.act(FilePath.java:979)
	at hudson.FilePath.act(FilePath.java:968)
	at hudson.scm.SubversionSCM.checkout(SubversionSCM.java:894)
	at hudson.scm.SubversionSCM.checkout(SubversionSCM.java:830)
	at hudson.scm.SCM.checkout(SCM.java:485)
	at hudson.model.AbstractProject.checkout(AbstractProject.java:1276)
	at hudson.model.AbstractBuild$AbstractBuildExecution.defaultCheckout(AbstractBuild.java:607)
	at jenkins.scm.SCMCheckoutStrategy.checkout(SCMCheckoutStrategy.java:86)
	at hudson.model.AbstractBuild$AbstractBuildExecution.run(AbstractBuild.java:529)
	at hudson.model.Run.execute(Run.java:1738)
	at hudson.model.FreeStyleBuild.run(FreeStyleBuild.java:43)
	at hudson.model.ResourceController.execute(ResourceController.java:98)
	at hudson.model.Executor.run(Executor.java:410)
Caused by: java.io.IOException: Unexpected termination of the channel
	at hudson.remoting.SynchronousCommandTransport$ReaderThread.run(SynchronousCommandTransport.java:50)
Caused by: java.io.EOFException
	at java.io.ObjectInputStream$PeekInputStream.readFully(ObjectInputStream.java:2325)
	at java.io.ObjectInputStream$BlockDataInputStream.readShort(ObjectInputStream.java:2794)
	at java.io.ObjectInputStream.readStreamHeader(ObjectInputStream.java:801)
	at java.io.ObjectInputStream.<init>(ObjectInputStream.java:299)
	at hudson.remoting.ObjectInputStreamEx.<init>(ObjectInputStreamEx.java:48)
	at hudson.remoting.AbstractSynchronousByteArrayCommandTransport.read(AbstractSynchronousByteArrayCommandTransport.java:34)
	at hudson.remoting.SynchronousCommandTransport$ReaderThread.run(SynchronousCommandTransport.java:48)
ERROR: Step ?Publish JUnit test result report? failed: no workspace for ZooKeeper_branch35_solaris
#161
Email was triggered for: Failure - Any
Sending email for trigger: Failure - Any



###################################################################################
############################## FAILED TESTS (if any) ##############################
No tests ran.
Mime
  • Unnamed multipart/mixed (inline, None, 0 bytes)
View raw message