zookeeper-dev mailing list archives

Site index · List index
Message view « Date » · « Thread »
Top « Date » · « Thread »
From Apache Jenkins Server <jenk...@builds.apache.org>
Subject ZooKeeper_branch35_openjdk7 - Build # 140 - Still Failing
Date Sun, 03 Jul 2016 10:13:13 GMT
See https://builds.apache.org/job/ZooKeeper_branch35_openjdk7/140/

###################################################################################
########################## LAST 60 LINES OF THE CONSOLE ###########################
[...truncated 435909 lines...]
     [exec] Log Message Received: [2016-07-03 10:10:53,139:1328(0x2ae978828540):ZOO_INFO@testLogCallbackInit@993:
testLogCallbackInit #8]
     [exec] Log Message Received: [2016-07-03 10:10:53,139:1328(0x2ae978828540):ZOO_INFO@testLogCallbackInit@993:
testLogCallbackInit #9]
     [exec] Log Message Received: [2016-07-03 10:10:53,139:1328(0x2ae978828540):ZOO_INFO@zookeeper_close@3257:
Closing zookeeper sessionId=0x1026867bab2000e to [127.0.0.1:22181]
     [exec] ]
     [exec]  : elapsed 1001 : OK
     [exec] Zookeeper_simpleSystem::testLogCallbackClearLog Message Received: [2016-07-03
10:10:53,140:1328(0x2ae978828540):ZOO_INFO@log_env@1027: Client environment:zookeeper.version=zookeeper
C client 3.5.2]
     [exec] Log Message Received: [2016-07-03 10:10:53,140:1328(0x2ae978828540):ZOO_INFO@log_env@1031:
Client environment:host.name=jenkins-ubuntu1]
     [exec] Log Message Received: [2016-07-03 10:10:53,140:1328(0x2ae978828540):ZOO_INFO@log_env@1038:
Client environment:os.name=Linux]
     [exec] Log Message Received: [2016-07-03 10:10:53,140:1328(0x2ae978828540):ZOO_INFO@log_env@1039:
Client environment:os.arch=3.19.0-25-generic]
     [exec] Log Message Received: [2016-07-03 10:10:53,140:1328(0x2ae978828540):ZOO_INFO@log_env@1040:
Client environment:os.version=#26~14.04.1-Ubuntu SMP Fri Jul 24 21:16:20 UTC 2015]
     [exec] Log Message Received: [2016-07-03 10:10:53,140:1328(0x2ae978828540):ZOO_INFO@log_env@1048:
Client environment:user.name=jenkins]
     [exec] Log Message Received: [2016-07-03 10:10:53,140:1328(0x2ae978828540):ZOO_INFO@log_env@1056:
Client environment:user.home=/home/jenkins]
     [exec] Log Message Received: [2016-07-03 10:10:53,140:1328(0x2ae978828540):ZOO_INFO@log_env@1068:
Client environment:user.dir=/home/jenkins/jenkins-slave/workspace/ZooKeeper_branch35_openjdk7/branch-3.5/build/test/test-cppunit]
     [exec] Log Message Received: [2016-07-03 10:10:53,140:1328(0x2ae978828540):ZOO_INFO@zookeeper_init_internal@1111:
Initiating client connection, host=127.0.0.1:22181 sessionTimeout=10000 watcher=0x45d2a0 sessionId=0
sessionPasswd=<null> context=0x7ffe7b3ba4a0 flags=0]
     [exec] Log Message Received: [2016-07-03 10:10:53,142:1328(0x2ae97a885700):ZOO_INFO@check_events@2357:
initiated connection to server [127.0.0.1:22181]]
     [exec] Log Message Received: [2016-07-03 10:10:53,149:1328(0x2ae97a885700):ZOO_INFO@check_events@2409:
session establishment complete on server [127.0.0.1:22181], sessionId=0x1026867bab2000f, negotiated
timeout=10000 ]
     [exec]  : elapsed 1001 : OK
     [exec] Zookeeper_simpleSystem::testAsyncWatcherAutoReset ZooKeeper server started : elapsed
10538 : OK
     [exec] Zookeeper_simpleSystem::testDeserializeString : elapsed 0 : OK
     [exec] Zookeeper_simpleSystem::testFirstServerDown : elapsed 1003 : OK
     [exec] Zookeeper_simpleSystem::testNullData : elapsed 1042 : OK
     [exec] Zookeeper_simpleSystem::testIPV6 : elapsed 1007 : OK
     [exec] Zookeeper_simpleSystem::testCreate : elapsed 1014 : OK
     [exec] Zookeeper_simpleSystem::testPath : elapsed 1026 : OK
     [exec] Zookeeper_simpleSystem::testPathValidation : elapsed 1083 : OK
     [exec] Zookeeper_simpleSystem::testPing : elapsed 17370 : OK
     [exec] Zookeeper_simpleSystem::testAcl : elapsed 1022 : OK
     [exec] Zookeeper_simpleSystem::testChroot : elapsed 3074 : OK
     [exec] Zookeeper_simpleSystem::testAuth ZooKeeper server started ZooKeeper server started
: elapsed 32420 : OK
     [exec] Zookeeper_simpleSystem::testHangingClient : elapsed 1046 : OK
     [exec] Zookeeper_simpleSystem::testWatcherAutoResetWithGlobal ZooKeeper server started
ZooKeeper server started ZooKeeper server started : elapsed 16966 : OK
     [exec] Zookeeper_simpleSystem::testWatcherAutoResetWithLocal ZooKeeper server started
ZooKeeper server started ZooKeeper server started : elapsed 17444 : OK
     [exec] Zookeeper_simpleSystem::testGetChildren2 : elapsed 1054 : OK
     [exec] Zookeeper_simpleSystem::testLastZxid : elapsed 4523 : OK
     [exec] Zookeeper_simpleSystem::testRemoveWatchers ZooKeeper server started : elapsed
5488 : OK
     [exec] Zookeeper_readOnly::testReadOnly : elapsed 4237 : OK
     [exec] /home/jenkins/jenkins-slave/workspace/ZooKeeper_branch35_openjdk7/branch-3.5/src/c/tests/TestReconfig.cc:183:
Assertion: equality assertion failed [Expected: 1, Actual  : 0]
     [exec] Failures !!!
     [exec] Run: 72   Failure total: 1   Failures: 1   Errors: 0
     [exec] FAIL: zktest-mt
     [exec] ==========================================
     [exec] 1 of 2 tests failed
     [exec] Please report to user@zookeeper.apache.org
     [exec] ==========================================
     [exec] make[1]: Leaving directory `/home/jenkins/jenkins-slave/workspace/ZooKeeper_branch35_openjdk7/branch-3.5/build/test/test-cppunit'
     [exec] make[1]: *** [check-TESTS] Error 1
     [exec] make: *** [check-am] Error 2

BUILD FAILED
/home/jenkins/jenkins-slave/workspace/ZooKeeper_branch35_openjdk7/branch-3.5/build.xml:1322:
The following error occurred while executing this line:
/home/jenkins/jenkins-slave/workspace/ZooKeeper_branch35_openjdk7/branch-3.5/build.xml:1282:
The following error occurred while executing this line:
/home/jenkins/jenkins-slave/workspace/ZooKeeper_branch35_openjdk7/branch-3.5/build.xml:1292:
exec returned: 2

Total time: 16 minutes 22 seconds
Build step 'Invoke Ant' marked build as failure
Archiving artifacts
Recording test results
Email was triggered for: Failure - Any
Sending email for trigger: Failure - Any



###################################################################################
############################## FAILED TESTS (if any) ##############################
All tests passed
Mime
  • Unnamed multipart/mixed (inline, None, 0 bytes)
View raw message