zookeeper-dev mailing list archives

Site index · List index
Message view « Date » · « Thread »
Top « Date » · « Thread »
From Apache Jenkins Server <jenk...@builds.apache.org>
Subject ZooKeeper-trunk - Build # 2982 - Still Failing
Date Fri, 01 Jul 2016 23:33:02 GMT
See https://builds.apache.org/job/ZooKeeper-trunk/2982/

###################################################################################
########################## LAST 60 LINES OF THE CONSOLE ###########################
[...truncated 439893 lines...]
     [exec] Log Message Received: [2016-07-01 23:31:13,765:29128(0x2b41278ef540):ZOO_INFO@log_env@1048:
Client environment:user.name=jenkins]
     [exec] Log Message Received: [2016-07-01 23:31:13,765:29128(0x2b41278ef540):ZOO_INFO@log_env@1056:
Client environment:user.home=/home/jenkins]
     [exec] Log Message Received: [2016-07-01 23:31:13,765:29128(0x2b41278ef540):ZOO_INFO@log_env@1068:
Client environment:user.dir=/home/jenkins/jenkins-slave/workspace/ZooKeeper-trunk/trunk/build/test/test-cppunit]
     [exec] Log Message Received: [2016-07-01 23:31:13,765:29128(0x2b41278ef540):ZOO_INFO@zookeeper_init_internal@1111:
Initiating client connection, host=127.0.0.1:22181 sessionTimeout=10000 watcher=0x45d2a0 sessionId=0
sessionPasswd=<null> context=0x7fff51fbf070 flags=0]
     [exec] Log Message Received: [2016-07-01 23:31:13,765:29128(0x2b4129f7e700):ZOO_INFO@check_events@2357:
initiated connection to server [127.0.0.1:22181]]
     [exec] Log Message Received: [2016-07-01 23:31:13,768:29128(0x2b4129f7e700):ZOO_INFO@check_events@2409:
session establishment complete on server [127.0.0.1:22181], sessionId=0x10100f85453000f, negotiated
timeout=10000 ]
     [exec]  : elapsed 1000 : OK
     [exec] Zookeeper_simpleSystem::testAsyncWatcherAutoReset ZooKeeper server started : elapsed
10206 : OK
     [exec] Zookeeper_simpleSystem::testDeserializeString : elapsed 0 : OK
     [exec] Zookeeper_simpleSystem::testFirstServerDown : elapsed 1000 : OK
     [exec] Zookeeper_simpleSystem::testNullData : elapsed 1025 : OK
     [exec] Zookeeper_simpleSystem::testIPV6 : elapsed 1004 : OK
     [exec] Zookeeper_simpleSystem::testCreate : elapsed 1006 : OK
     [exec] Zookeeper_simpleSystem::testPath : elapsed 1010 : OK
     [exec] Zookeeper_simpleSystem::testPathValidation : elapsed 1036 : OK
     [exec] Zookeeper_simpleSystem::testPing : elapsed 17151 : OK
     [exec] Zookeeper_simpleSystem::testAcl : elapsed 1012 : OK
     [exec] Zookeeper_simpleSystem::testChroot : elapsed 3033 : OK
     [exec] Zookeeper_simpleSystem::testAuth ZooKeeper server started ZooKeeper server started
: elapsed 30414 : OK
     [exec] Zookeeper_simpleSystem::testHangingClient : elapsed 1023 : OK
     [exec] Zookeeper_simpleSystem::testWatcherAutoResetWithGlobal ZooKeeper server started
ZooKeeper server started ZooKeeper server started : elapsed 14640 : OK
     [exec] Zookeeper_simpleSystem::testWatcherAutoResetWithLocal ZooKeeper server started
ZooKeeper server started ZooKeeper server started : elapsed 14653 : OK
     [exec] Zookeeper_simpleSystem::testGetChildren2 : elapsed 1039 : OK
     [exec] Zookeeper_simpleSystem::testLastZxid : elapsed 4511 : OK
     [exec] Zookeeper_simpleSystem::testRemoveWatchers ZooKeeper server started : elapsed
4269 : OK
     [exec] Zookeeper_readOnly::testReadOnly : elapsed 4112 : OK
     [exec] /home/jenkins/jenkins-slave/workspace/ZooKeeper-trunk/trunk/src/c/tests/TestReconfig.cc:183:
Assertion: equality assertion failed [Expected: 1, Actual  : 0]
     [exec] Failures !!!
     [exec] Run: 72   Failure total: 1   Failures: 1   Errors: 0
     [exec] FAIL: zktest-mt
     [exec] ==========================================
     [exec] 1 of 2 tests failed
     [exec] Please report to user@zookeeper.apache.org
     [exec] ==========================================
     [exec] make[1]: Leaving directory `/home/jenkins/jenkins-slave/workspace/ZooKeeper-trunk/trunk/build/test/test-cppunit'
     [exec] make[1]: *** [check-TESTS] Error 1
     [exec] make: *** [check-am] Error 2

BUILD FAILED
/home/jenkins/jenkins-slave/workspace/ZooKeeper-trunk/trunk/build.xml:1322: The following
error occurred while executing this line:
/home/jenkins/jenkins-slave/workspace/ZooKeeper-trunk/trunk/build.xml:1282: The following
error occurred while executing this line:
/home/jenkins/jenkins-slave/workspace/ZooKeeper-trunk/trunk/build.xml:1292: exec returned:
2

Total time: 15 minutes 30 seconds
Build step 'Execute shell' marked build as failure
[FINDBUGS] Skipping publisher since build result is FAILURE
[WARNINGS] Skipping publisher since build result is FAILURE
Archiving artifacts
Setting LATEST1_7_HOME=/home/jenkins/jenkins-slave/tools/hudson.model.JDK/latest1.7
Recording fingerprints
Setting LATEST1_7_HOME=/home/jenkins/jenkins-slave/tools/hudson.model.JDK/latest1.7
Recording test results
Setting LATEST1_7_HOME=/home/jenkins/jenkins-slave/tools/hudson.model.JDK/latest1.7
Publishing Javadoc
Setting LATEST1_7_HOME=/home/jenkins/jenkins-slave/tools/hudson.model.JDK/latest1.7
Email was triggered for: Failure - Any
Sending email for trigger: Failure - Any
Setting LATEST1_7_HOME=/home/jenkins/jenkins-slave/tools/hudson.model.JDK/latest1.7
Setting LATEST1_7_HOME=/home/jenkins/jenkins-slave/tools/hudson.model.JDK/latest1.7



###################################################################################
############################## FAILED TESTS (if any) ##############################
All tests passed
Mime
  • Unnamed multipart/mixed (inline, None, 0 bytes)
View raw message