zookeeper-dev mailing list archives

Site index · List index
Message view « Date » · « Thread »
Top « Date » · « Thread »
From Apache Jenkins Server <jenk...@builds.apache.org>
Subject ZooKeeper-trunk-solaris - Build # 1218 - Still Failing
Date Sun, 03 Jul 2016 07:27:14 GMT
See https://builds.apache.org/job/ZooKeeper-trunk-solaris/1218/

###################################################################################
########################## LAST 60 LINES OF THE CONSOLE ###########################
[...truncated 300 lines...]
    [junit] 2016-07-03 07:27:55,938 [myid:] - INFO  [main:Environment@109] - Client environment:user.dir=/zonestorage/hudson_solaris/home/hudson/hudson-slave/workspace/ZooKeeper-trunk-solaris/trunk/build/test
    [junit] 2016-07-03 07:27:55,938 [myid:] - INFO  [main:Environment@109] - Client environment:os.memory.free=51MB
    [junit] 2016-07-03 07:27:55,938 [myid:] - INFO  [main:Environment@109] - Client environment:os.memory.max=454MB
    [junit] 2016-07-03 07:27:55,938 [myid:] - INFO  [main:Environment@109] - Client environment:os.memory.total=61MB
    [junit] 2016-07-03 07:27:56,367 [myid:] - INFO  [main:ZooKeeper@855] - Initiating client
connection, connectString=127.0.0.1:11222 sessionTimeout=30000 watcher=org.apache.zookeeper.CustomHostProviderTest@13ceeb6
    [junit] 2016-07-03 07:27:57,756 [myid:] - INFO  [main:ZooKeeper@855] - Initiating client
connection, connectString=127.0.0.1:11222 sessionTimeout=30000 watcher=org.apache.zookeeper.CustomHostProviderTest@13ceeb6
    [junit] 2016-07-03 07:27:57,758 [myid:] - INFO  [main:PortAssignment@85] - Assigned port
11223 from range 11221 - 32767.
    [junit] 2016-07-03 07:27:57,758 [myid:] - INFO  [main:ClientCnxnSocketNIO@378] - testableCloseSocket()
called
    [junit] 2016-07-03 07:27:57,759 [myid:] - INFO  [main:PortAssignment@85] - Assigned port
11224 from range 11221 - 32767.
    [junit] 2016-07-03 07:27:57,759 [myid:] - INFO  [main:JUnit4ZKTestRunner$LoggedInvokeMethod@82]
- Memory used 11998
    [junit] 2016-07-03 07:27:57,759 [myid:] - INFO  [main:JUnit4ZKTestRunner$LoggedInvokeMethod@87]
- Number of threads 8
    [junit] 2016-07-03 07:27:57,760 [myid:] - INFO  [main:JUnit4ZKTestRunner$LoggedInvokeMethod@102]
- FINISHED TEST METHOD testZooKeeperWithCustomHostProvider
    [junit] 2016-07-03 07:27:57,760 [myid:] - INFO  [main:ZKTestCase$1@65] - SUCCEEDED testZooKeeperWithCustomHostProvider
    [junit] 2016-07-03 07:27:57,760 [myid:] - INFO  [main:ZKTestCase$1@60] - FINISHED testZooKeeperWithCustomHostProvider
    [junit] 2016-07-03 07:27:58,142 [myid:127.0.0.1:11223] - INFO  [main-SendThread(127.0.0.1:11223):ClientCnxn$SendThread@1113]
- Opening socket connection to server 127.0.0.1/127.0.0.1:11223. Will not attempt to authenticate
using SASL (unknown error)
    [junit] 2016-07-03 07:27:58,142 [myid:127.0.0.1:2181] - INFO  [main-SendThread(127.0.0.1:2181):ClientCnxn$SendThread@1113]
- Opening socket connection to server /127.0.0.1:2181. Will not attempt to authenticate using
SASL (unknown error)
    [junit] Tests run: 1, Failures: 0, Errors: 0, Time elapsed: 3.512 sec
    [junit] 2016-07-03 07:28:08,136 [myid:] - INFO  [main:JUnit4ZKTestRunner@47] - No test.method
specified. using default methods.
    [junit] Running org.apache.zookeeper.MultiResponseTest
    [junit] 2016-07-03 07:28:09,001 [myid:] - INFO  [main:JUnit4ZKTestRunner@47] - No test.method
specified. using default methods.
    [junit] 2016-07-03 07:28:09,153 [myid:] - INFO  [main:ZKTestCase$1@55] - STARTING testEmptyRoundTrip
    [junit] 2016-07-03 07:28:09,158 [myid:] - INFO  [main:JUnit4ZKTestRunner$LoggedInvokeMethod@77]
- RUNNING TEST METHOD testEmptyRoundTrip
    [junit] 2016-07-03 07:28:09,578 [myid:] - INFO  [main:JUnit4ZKTestRunner$LoggedInvokeMethod@82]
- Memory used 9853
    [junit] 2016-07-03 07:28:09,578 [myid:] - INFO  [main:JUnit4ZKTestRunner$LoggedInvokeMethod@87]
- Number of threads 4
    [junit] 2016-07-03 07:28:09,578 [myid:] - INFO  [main:JUnit4ZKTestRunner$LoggedInvokeMethod@102]
- FINISHED TEST METHOD testEmptyRoundTrip
    [junit] 2016-07-03 07:28:09,579 [myid:] - INFO  [main:ZKTestCase$1@65] - SUCCEEDED testEmptyRoundTrip
    [junit] 2016-07-03 07:28:09,579 [myid:] - INFO  [main:ZKTestCase$1@60] - FINISHED testEmptyRoundTrip
    [junit] Tests run: 1, Failures: 0, Errors: 0, Time elapsed: 1.666 sec
    [junit] 2016-07-03 07:28:20,744 [myid:] - INFO  [main:JUnit4ZKTestRunner@47] - No test.method
specified. using default methods.
    [junit] Running org.apache.zookeeper.MultiTransactionRecordTest
    [junit] 2016-07-03 07:28:23,934 [myid:] - INFO  [main:JUnit4ZKTestRunner@47] - No test.method
specified. using default methods.
    [junit] 2016-07-03 07:28:24,867 [myid:] - INFO  [main:ZKTestCase$1@55] - STARTING testEmptyRoundTrip
    [junit] 2016-07-03 07:28:24,895 [myid:] - INFO  [main:JUnit4ZKTestRunner$LoggedInvokeMethod@77]
- RUNNING TEST METHOD testEmptyRoundTrip
    [junit] 2016-07-03 07:28:25,079 [myid:] - INFO  [main:JUnit4ZKTestRunner$LoggedInvokeMethod@82]
- Memory used 9525
    [junit] 2016-07-03 07:28:25,079 [myid:] - INFO  [main:JUnit4ZKTestRunner$LoggedInvokeMethod@87]
- Number of threads 4
    [junit] 2016-07-03 07:28:25,079 [myid:] - INFO  [main:JUnit4ZKTestRunner$LoggedInvokeMethod@102]
- FINISHED TEST METHOD testEmptyRoundTrip
    [junit] 2016-07-03 07:28:25,079 [myid:] - INFO  [main:ZKTestCase$1@65] - SUCCEEDED testEmptyRoundTrip
    [junit] 2016-07-03 07:28:25,080 [myid:] - INFO  [main:ZKTestCase$1@60] - FINISHED testEmptyRoundTrip
    [junit] 2016-07-03 07:28:25,114 [myid:] - INFO  [main:ZKTestCase$1@55] - STARTING testRoundTrip
    [junit] 2016-07-03 07:28:25,114 [myid:] - INFO  [main:JUnit4ZKTestRunner$LoggedInvokeMethod@77]
- RUNNING TEST METHOD testRoundTrip
    [junit] 2016-07-03 07:28:25,407 [myid:] - INFO  [main:JUnit4ZKTestRunner$LoggedInvokeMethod@82]
- Memory used 10207
    [junit] 2016-07-03 07:28:25,407 [myid:] - INFO  [main:JUnit4ZKTestRunner$LoggedInvokeMethod@87]
- Number of threads 4
    [junit] 2016-07-03 07:28:25,407 [myid:] - INFO  [main:JUnit4ZKTestRunner$LoggedInvokeMethod@102]
- FINISHED TEST METHOD testRoundTrip
    [junit] 2016-07-03 07:28:25,407 [myid:] - INFO  [main:ZKTestCase$1@65] - SUCCEEDED testRoundTrip
    [junit] 2016-07-03 07:28:25,407 [myid:] - INFO  [main:ZKTestCase$1@60] - FINISHED testRoundTrip
    [junit] Tests run: 2, Failures: 0, Errors: 0, Time elapsed: 4.591 sec
    [junit] Running org.apache.zookeeper.PortAssignmentTest
    [junit] Tests run: 1, Failures: 0, Errors: 1, Time elapsed: 0 sec

BUILD FAILED
/zonestorage/hudson_solaris/home/hudson/hudson-slave/workspace/ZooKeeper-trunk-solaris/trunk/build.xml:1219:
Process fork failed.

Total time: 6 minutes 44 seconds
Build step 'Invoke Ant' marked build as failure
[locks-and-latches] Releasing all the locks
[locks-and-latches] All the locks released
Recording test results
Email was triggered for: Failure - Any
Sending email for trigger: Failure - Any



###################################################################################
############################## FAILED TESTS (if any) ##############################
1 tests failed.
FAILED:  org.apache.zookeeper.PortAssignmentTest.unknown

Error Message:
Forked Java VM exited abnormally. Please note the time in the report does not reflect the
time until the VM exit.

Stack Trace:
junit.framework.AssertionFailedError: Forked Java VM exited abnormally. Please note the time
in the report does not reflect the time until the VM exit.



Mime
  • Unnamed multipart/mixed (inline, None, 0 bytes)
View raw message