zookeeper-dev mailing list archives

Site index · List index
Message view « Date » · « Thread »
Top « Date » · « Thread »
From Apache Jenkins Server <jenk...@builds.apache.org>
Subject ZooKeeper_branch34_solaris - Build # 1208 - Failure
Date Tue, 05 Jul 2016 13:50:36 GMT
See https://builds.apache.org/job/ZooKeeper_branch34_solaris/1208/

###################################################################################
########################## LAST 60 LINES OF THE CONSOLE ###########################
[...truncated 50882 lines...]
    [junit] 2016-07-05 13:51:25,839 [myid:] - INFO  [main:JMXEnv@229] - ensureParent:[InMemoryDataTree,
StandaloneServer_port]
    [junit] 2016-07-05 13:51:25,840 [myid:] - INFO  [main:JMXEnv@246] - expect:InMemoryDataTree
    [junit] 2016-07-05 13:51:25,840 [myid:] - INFO  [main:JMXEnv@250] - found:InMemoryDataTree
org.apache.ZooKeeperService:name0=StandaloneServer_port11224,name1=InMemoryDataTree
    [junit] 2016-07-05 13:51:25,840 [myid:] - INFO  [main:JMXEnv@246] - expect:StandaloneServer_port
    [junit] 2016-07-05 13:51:25,841 [myid:] - INFO  [main:JMXEnv@250] - found:StandaloneServer_port
org.apache.ZooKeeperService:name0=StandaloneServer_port11224
    [junit] 2016-07-05 13:51:26,531 [myid:] - INFO  [main-SendThread(127.0.0.1:11224):ClientCnxn$SendThread@1032]
- Opening socket connection to server 127.0.0.1/127.0.0.1:11224. Will not attempt to authenticate
using SASL (java.lang.SecurityException: Unable to locate a login configuration)
    [junit] 2016-07-05 13:51:26,532 [myid:] - INFO  [main-SendThread(127.0.0.1:11224):ClientCnxn$SendThread@876]
- Socket connection established to 127.0.0.1/127.0.0.1:11224, initiating session
    [junit] 2016-07-05 13:51:26,532 [myid:] - INFO  [NIOServerCxn.Factory:0.0.0.0/0.0.0.0:11224:NIOServerCnxnFactory@192]
- Accepted socket connection from /127.0.0.1:61764
    [junit] 2016-07-05 13:51:26,533 [myid:] - INFO  [NIOServerCxn.Factory:0.0.0.0/0.0.0.0:11224:ZooKeeperServer@893]
- Client attempting to renew session 0x155bb53a4a30000 at /127.0.0.1:61764
    [junit] 2016-07-05 13:51:26,533 [myid:] - INFO  [NIOServerCxn.Factory:0.0.0.0/0.0.0.0:11224:ZooKeeperServer@645]
- Established session 0x155bb53a4a30000 with negotiated timeout 30000 for client /127.0.0.1:61764
    [junit] 2016-07-05 13:51:26,533 [myid:] - INFO  [main-SendThread(127.0.0.1:11224):ClientCnxn$SendThread@1299]
- Session establishment complete on server 127.0.0.1/127.0.0.1:11224, sessionid = 0x155bb53a4a30000,
negotiated timeout = 30000
    [junit] 2016-07-05 13:51:27,001 [myid:] - INFO  [SessionTracker:SessionTrackerImpl@162]
- SessionTrackerImpl exited loop!
    [junit] 2016-07-05 13:51:27,231 [myid:] - INFO  [main-SendThread(127.0.0.1:11224):ClientCnxn$SendThread@1032]
- Opening socket connection to server 127.0.0.1/127.0.0.1:11224. Will not attempt to authenticate
using SASL (java.lang.SecurityException: Unable to locate a login configuration)
    [junit] 2016-07-05 13:51:27,231 [myid:] - INFO  [main-SendThread(127.0.0.1:11224):ClientCnxn$SendThread@876]
- Socket connection established to 127.0.0.1/127.0.0.1:11224, initiating session
    [junit] 2016-07-05 13:51:27,231 [myid:] - INFO  [NIOServerCxn.Factory:0.0.0.0/0.0.0.0:11224:NIOServerCnxnFactory@192]
- Accepted socket connection from /127.0.0.1:61765
    [junit] 2016-07-05 13:51:27,238 [myid:] - INFO  [NIOServerCxn.Factory:0.0.0.0/0.0.0.0:11224:ZooKeeperServer@893]
- Client attempting to renew session 0x155bb53a4a30001 at /127.0.0.1:61765
    [junit] 2016-07-05 13:51:27,238 [myid:] - INFO  [NIOServerCxn.Factory:0.0.0.0/0.0.0.0:11224:ZooKeeperServer@645]
- Established session 0x155bb53a4a30001 with negotiated timeout 30000 for client /127.0.0.1:61765
    [junit] 2016-07-05 13:51:27,238 [myid:] - INFO  [main-SendThread(127.0.0.1:11224):ClientCnxn$SendThread@1299]
- Session establishment complete on server 127.0.0.1/127.0.0.1:11224, sessionid = 0x155bb53a4a30001,
negotiated timeout = 30000
    [junit] 2016-07-05 13:51:27,251 [myid:] - INFO  [SyncThread:0:FileTxnLog@203] - Creating
new log file: log.2714
    [junit] 2016-07-05 13:51:41,761 [myid:] - INFO  [main:JUnit4ZKTestRunner$LoggedInvokeMethod@58]
- Memory used 54658
    [junit] 2016-07-05 13:51:41,761 [myid:] - INFO  [main:JUnit4ZKTestRunner$LoggedInvokeMethod@63]
- Number of threads 20
    [junit] 2016-07-05 13:51:41,761 [myid:] - INFO  [main:JUnit4ZKTestRunner$LoggedInvokeMethod@78]
- FINISHED TEST METHOD testManyChildWatchersAutoReset
    [junit] 2016-07-05 13:51:41,761 [myid:] - INFO  [main:ClientBase@520] - tearDown starting
    [junit] 2016-07-05 13:51:41,762 [myid:] - INFO  [ProcessThread(sid:0 cport:11224)::PrepRequestProcessor@487]
- Processed session termination for sessionid: 0x155bb53a4a30000
    [junit] 2016-07-05 13:51:41,763 [myid:] - INFO  [main:ZooKeeper@684] - Session: 0x155bb53a4a30000
closed
    [junit] 2016-07-05 13:51:41,763 [myid:] - INFO  [main-EventThread:ClientCnxn$EventThread@519]
- EventThread shut down for session: 0x155bb53a4a30000
    [junit] 2016-07-05 13:51:41,764 [myid:] - INFO  [NIOServerCxn.Factory:0.0.0.0/0.0.0.0:11224:NIOServerCnxn@1008]
- Closed socket connection for client /127.0.0.1:61764 which had sessionid 0x155bb53a4a30000
    [junit] 2016-07-05 13:51:41,773 [myid:] - INFO  [ProcessThread(sid:0 cport:11224)::PrepRequestProcessor@487]
- Processed session termination for sessionid: 0x155bb53a4a30001
    [junit] 2016-07-05 13:51:41,774 [myid:] - INFO  [main:ZooKeeper@684] - Session: 0x155bb53a4a30001
closed
    [junit] 2016-07-05 13:51:41,774 [myid:] - INFO  [NIOServerCxn.Factory:0.0.0.0/0.0.0.0:11224:NIOServerCnxn@1008]
- Closed socket connection for client /127.0.0.1:61765 which had sessionid 0x155bb53a4a30001
    [junit] 2016-07-05 13:51:41,774 [myid:] - INFO  [main:ClientBase@490] - STOPPING server
    [junit] 2016-07-05 13:51:41,774 [myid:] - INFO  [main-EventThread:ClientCnxn$EventThread@519]
- EventThread shut down for session: 0x155bb53a4a30001
    [junit] 2016-07-05 13:51:41,775 [myid:] - INFO  [main:ZooKeeperServer@469] - shutting
down
    [junit] 2016-07-05 13:51:41,775 [myid:] - INFO  [main:SessionTrackerImpl@225] - Shutting
down
    [junit] 2016-07-05 13:51:41,775 [myid:] - INFO  [main:PrepRequestProcessor@765] - Shutting
down
    [junit] 2016-07-05 13:51:41,775 [myid:] - INFO  [main:SyncRequestProcessor@209] - Shutting
down
    [junit] 2016-07-05 13:51:41,775 [myid:] - INFO  [ProcessThread(sid:0 cport:11224)::PrepRequestProcessor@143]
- PrepRequestProcessor exited loop!
    [junit] 2016-07-05 13:51:41,775 [myid:] - INFO  [SyncThread:0:SyncRequestProcessor@187]
- SyncRequestProcessor exited!
    [junit] 2016-07-05 13:51:41,776 [myid:] - INFO  [main:FinalRequestProcessor@402] - shutdown
of request processor complete
    [junit] 2016-07-05 13:51:41,776 [myid:] - INFO  [main:FourLetterWordMain@62] - connecting
to 127.0.0.1 11224
    [junit] 2016-07-05 13:51:41,777 [myid:] - INFO  [main:JMXEnv@146] - ensureOnly:[]
    [junit] 2016-07-05 13:51:41,865 [myid:] - INFO  [main:ClientBase@545] - fdcount after
test is: 46 at start it was 46
    [junit] 2016-07-05 13:51:41,865 [myid:] - INFO  [main:ZKTestCase$1@60] - SUCCEEDED testManyChildWatchersAutoReset
    [junit] 2016-07-05 13:51:41,865 [myid:] - INFO  [main:ZKTestCase$1@55] - FINISHED testManyChildWatchersAutoReset
    [junit] Tests run: 4, Failures: 0, Errors: 0, Time elapsed: 49.307 sec
    [junit] 2016-07-05 13:51:42,001 [myid:] - INFO  [SessionTracker:SessionTrackerImpl@162]
- SessionTrackerImpl exited loop!
    [junit] Running org.apache.zookeeper.test.EventTypeTest
    [junit] Tests run: 1, Failures: 0, Errors: 1, Time elapsed: 0 sec

BUILD FAILED
/zonestorage/hudson_solaris/home/hudson/hudson-slave/workspace/ZooKeeper_branch34_solaris/trunk/build.xml:1289:
Process fork failed.

Total time: 21 minutes 20 seconds
Build step 'Invoke Ant' marked build as failure
[locks-and-latches] Releasing all the locks
[locks-and-latches] All the locks released
Recording test results
Email was triggered for: Failure - Any
Sending email for trigger: Failure - Any



###################################################################################
############################## FAILED TESTS (if any) ##############################
1 tests failed.
FAILED:  org.apache.zookeeper.test.EventTypeTest.unknown

Error Message:
Forked Java VM exited abnormally. Please note the time in the report does not reflect the
time until the VM exit.

Stack Trace:
junit.framework.AssertionFailedError: Forked Java VM exited abnormally. Please note the time
in the report does not reflect the time until the VM exit.



Mime
  • Unnamed multipart/mixed (inline, None, 0 bytes)
View raw message