zookeeper-dev mailing list archives

Site index · List index
Message view « Date » · « Thread »
Top « Date » · « Thread »
From Apache Jenkins Server <jenk...@builds.apache.org>
Subject ZooKeeper_branch35_solaris - Build # 158 - Still Failing
Date Sat, 02 Jul 2016 16:40:58 GMT
See https://builds.apache.org/job/ZooKeeper_branch35_solaris/158/

###################################################################################
########################## LAST 60 LINES OF THE CONSOLE ###########################
[...truncated 38716 lines...]
    [junit] 2016-07-02 16:42:25,635 [myid:] - INFO  [main:FourLetterWordMain@85] - connecting
to 127.0.0.1 11285
    [junit] 2016-07-02 16:42:25,636 [myid:] - INFO  [main:JUnit4ZKTestRunner$LoggedInvokeMethod@82]
- Memory used 17116
    [junit] 2016-07-02 16:42:25,636 [myid:] - INFO  [main:JUnit4ZKTestRunner$LoggedInvokeMethod@87]
- Number of threads 94
    [junit] 2016-07-02 16:42:25,636 [myid:] - INFO  [main:JUnit4ZKTestRunner$LoggedInvokeMethod@102]
- FINISHED TEST METHOD testBadPeerAddressInQuorum
    [junit] 2016-07-02 16:42:25,636 [myid:] - INFO  [main:QuorumPeerMainTest@63] - No servers
to shutdown!
    [junit] 2016-07-02 16:42:25,636 [myid:] - INFO  [main:ZKTestCase$1@65] - SUCCEEDED testBadPeerAddressInQuorum
    [junit] 2016-07-02 16:42:25,636 [myid:] - INFO  [main:ZKTestCase$1@60] - FINISHED testBadPeerAddressInQuorum
    [junit] 2016-07-02 16:42:25,731 [myid:127.0.0.1:11246] - INFO  [main-SendThread(127.0.0.1:11246):ClientCnxn$SendThread@1113]
- Opening socket connection to server 127.0.0.1/127.0.0.1:11246. Will not attempt to authenticate
using SASL (unknown error)
    [junit] 2016-07-02 16:42:25,731 [myid:127.0.0.1:11246] - ERROR [main-SendThread(127.0.0.1:11246):ClientCnxnSocketNIO@287]
- Unable to open socket to 127.0.0.1/127.0.0.1:11246
    [junit] 2016-07-02 16:42:25,731 [myid:127.0.0.1:11246] - WARN  [main-SendThread(127.0.0.1:11246):ClientCnxn$SendThread@1235]
- Session 0x122297897ba0000 for server 127.0.0.1/127.0.0.1:11246, unexpected error, closing
socket connection and attempting reconnect
    [junit] java.net.ConnectException: Connection refused
    [junit] 	at sun.nio.ch.Net.connect0(Native Method)
    [junit] 	at sun.nio.ch.Net.connect(Net.java:465)
    [junit] 	at sun.nio.ch.Net.connect(Net.java:457)
    [junit] 	at sun.nio.ch.SocketChannelImpl.connect(SocketChannelImpl.java:670)
    [junit] 	at org.apache.zookeeper.ClientCnxnSocketNIO.registerAndConnect(ClientCnxnSocketNIO.java:275)
    [junit] 	at org.apache.zookeeper.ClientCnxnSocketNIO.connect(ClientCnxnSocketNIO.java:285)
    [junit] 	at org.apache.zookeeper.ClientCnxn$SendThread.startConnect(ClientCnxn.java:1098)
    [junit] 	at org.apache.zookeeper.ClientCnxn$SendThread.run(ClientCnxn.java:1133)
    [junit] 2016-07-02 16:42:25,831 [myid:1] - INFO  [WorkerReceiver[myid=1]:FastLeaderElection$Messenger$WorkerReceiver@440]
- WorkerReceiver is down
    [junit] 2016-07-02 16:42:25,831 [myid:1] - INFO  [WorkerSender[myid=1]:FastLeaderElection$Messenger$WorkerSender@470]
- WorkerSender is down
    [junit] Tests run: 10, Failures: 0, Errors: 0, Time elapsed: 138.628 sec
    [junit] 2016-07-02 16:42:26,051 [myid:127.0.0.1:11258] - INFO  [main-SendThread(127.0.0.1:11258):ClientCnxn$SendThread@1113]
- Opening socket connection to server 127.0.0.1/127.0.0.1:11258. Will not attempt to authenticate
using SASL (unknown error)
    [junit] 2016-07-02 16:42:26,051 [myid:127.0.0.1:11258] - ERROR [main-SendThread(127.0.0.1:11258):ClientCnxnSocketNIO@287]
- Unable to open socket to 127.0.0.1/127.0.0.1:11258
    [junit] 2016-07-02 16:42:26,051 [myid:127.0.0.1:11258] - WARN  [main-SendThread(127.0.0.1:11258):ClientCnxn$SendThread@1235]
- Session 0x22297913540000 for server null, unexpected error, closing socket connection and
attempting reconnect
    [junit] java.net.ConnectException: Connection refused
    [junit] 	at sun.nio.ch.Net.connect0(Native Method)
    [junit] 	at sun.nio.ch.Net.connect(Net.java:465)
    [junit] 	at sun.nio.ch.Net.connect(Net.java:457)
    [junit] 	at sun.nio.ch.SocketChannelImpl.connect(SocketChannelImpl.java:670)
    [junit] 	at org.apache.zookeeper.ClientCnxnSocketNIO.registerAndConnect(ClientCnxnSocketNIO.java:275)
    [junit] 	at org.apache.zookeeper.ClientCnxnSocketNIO.connect(ClientCnxnSocketNIO.java:285)
    [junit] 	at org.apache.zookeeper.ClientCnxn$SendThread.startConnect(ClientCnxn.java:1098)
    [junit] 	at org.apache.zookeeper.ClientCnxn$SendThread.run(ClientCnxn.java:1133)
    [junit] 2016-07-02 16:42:26,161 [myid:127.0.0.1:11264] - INFO  [main-SendThread(127.0.0.1:11264):ClientCnxn$SendThread@1113]
- Opening socket connection to server 127.0.0.1/127.0.0.1:11264. Will not attempt to authenticate
using SASL (unknown error)
    [junit] 2016-07-02 16:42:26,161 [myid:127.0.0.1:11264] - ERROR [main-SendThread(127.0.0.1:11264):ClientCnxnSocketNIO@287]
- Unable to open socket to 127.0.0.1/127.0.0.1:11264
    [junit] 2016-07-02 16:42:26,161 [myid:127.0.0.1:11264] - WARN  [main-SendThread(127.0.0.1:11264):ClientCnxn$SendThread@1235]
- Session 0x2222979137b0000 for server null, unexpected error, closing socket connection and
attempting reconnect
    [junit] java.net.ConnectException: Connection refused
    [junit] 	at sun.nio.ch.Net.connect0(Native Method)
    [junit] 	at sun.nio.ch.Net.connect(Net.java:465)
    [junit] 	at sun.nio.ch.Net.connect(Net.java:457)
    [junit] 	at sun.nio.ch.SocketChannelImpl.connect(SocketChannelImpl.java:670)
    [junit] 	at org.apache.zookeeper.ClientCnxnSocketNIO.registerAndConnect(ClientCnxnSocketNIO.java:275)
    [junit] 	at org.apache.zookeeper.ClientCnxnSocketNIO.connect(ClientCnxnSocketNIO.java:285)
    [junit] 	at org.apache.zookeeper.ClientCnxn$SendThread.startConnect(ClientCnxn.java:1098)
    [junit] 	at org.apache.zookeeper.ClientCnxn$SendThread.run(ClientCnxn.java:1133)
    [junit] Running org.apache.zookeeper.server.quorum.QuorumPeerTest
    [junit] Tests run: 1, Failures: 0, Errors: 1, Time elapsed: 0 sec

BUILD FAILED
/zonestorage/hudson_solaris/home/hudson/hudson-slave/workspace/ZooKeeper_branch35_solaris/branch-3.5/build.xml:1219:
Process fork failed.

Total time: 30 minutes 9 seconds
Build step 'Invoke Ant' marked build as failure
[locks-and-latches] Releasing all the locks
[locks-and-latches] All the locks released
Recording test results
Email was triggered for: Failure - Any
Sending email for trigger: Failure - Any



###################################################################################
############################## FAILED TESTS (if any) ##############################
2 tests failed.
FAILED:  org.apache.zookeeper.server.quorum.FLEBackwardElectionRoundTest.testBackwardElectionRound

Error Message:
Should not have joined

Stack Trace:
junit.framework.AssertionFailedError: Should not have joined
	at org.apache.zookeeper.server.quorum.FLEBackwardElectionRoundTest.testBackwardElectionRound(FLEBackwardElectionRoundTest.java:146)
	at org.apache.zookeeper.JUnit4ZKTestRunner$LoggedInvokeMethod.evaluate(JUnit4ZKTestRunner.java:79)


FAILED:  org.apache.zookeeper.server.quorum.QuorumPeerTest.unknown

Error Message:
Forked Java VM exited abnormally. Please note the time in the report does not reflect the
time until the VM exit.

Stack Trace:
junit.framework.AssertionFailedError: Forked Java VM exited abnormally. Please note the time
in the report does not reflect the time until the VM exit.



Mime
  • Unnamed multipart/mixed (inline, None, 0 bytes)
View raw message