zookeeper-dev mailing list archives

Site index · List index
Message view « Date » · « Thread »
Top « Date » · « Thread »
From Apache Jenkins Server <jenk...@builds.apache.org>
Subject ZooKeeper_branch34_jdk7 - Build # 1074 - Failure
Date Mon, 02 May 2016 02:42:18 GMT
See https://builds.apache.org/job/ZooKeeper_branch34_jdk7/1074/

###################################################################################
########################## LAST 60 LINES OF THE CONSOLE ###########################
[...truncated 190141 lines...]
    [junit] 2016-05-02 02:41:59,494 [myid:] - INFO  [main:PrepRequestProcessor@765] - Shutting
down
    [junit] 2016-05-02 02:41:59,495 [myid:] - INFO  [main:SyncRequestProcessor@209] - Shutting
down
    [junit] 2016-05-02 02:41:59,495 [myid:] - INFO  [ProcessThread(sid:0 cport:11221)::PrepRequestProcessor@143]
- PrepRequestProcessor exited loop!
    [junit] 2016-05-02 02:41:59,495 [myid:] - INFO  [SyncThread:0:SyncRequestProcessor@187]
- SyncRequestProcessor exited!
    [junit] 2016-05-02 02:41:59,496 [myid:] - INFO  [main:FinalRequestProcessor@402] - shutdown
of request processor complete
    [junit] 2016-05-02 02:41:59,496 [myid:] - INFO  [main:FourLetterWordMain@62] - connecting
to 127.0.0.1 11221
    [junit] 2016-05-02 02:41:59,497 [myid:] - INFO  [main:JMXEnv@146] - ensureOnly:[]
    [junit] 2016-05-02 02:41:59,498 [myid:] - INFO  [main:ClientBase@443] - STARTING server
    [junit] 2016-05-02 02:41:59,499 [myid:] - INFO  [main:ClientBase@364] - CREATING server
instance 127.0.0.1:11221
    [junit] 2016-05-02 02:41:59,499 [myid:] - INFO  [main:NIOServerCnxnFactory@89] - binding
to port 0.0.0.0/0.0.0.0:11221
    [junit] 2016-05-02 02:41:59,499 [myid:] - INFO  [main:ClientBase@339] - STARTING server
instance 127.0.0.1:11221
    [junit] 2016-05-02 02:41:59,500 [myid:] - INFO  [main:ZooKeeperServer@170] - Created server
with tickTime 3000 minSessionTimeout 6000 maxSessionTimeout 60000 datadir /home/jenkins/jenkins-slave/workspace/ZooKeeper_branch34_jdk7/branch-3.4/build/test/tmp/test5786868463959297319.junit.dir/version-2
snapdir /home/jenkins/jenkins-slave/workspace/ZooKeeper_branch34_jdk7/branch-3.4/build/test/tmp/test5786868463959297319.junit.dir/version-2
    [junit] 2016-05-02 02:41:59,504 [myid:] - INFO  [main:FourLetterWordMain@62] - connecting
to 127.0.0.1 11221
    [junit] 2016-05-02 02:41:59,505 [myid:] - INFO  [NIOServerCxn.Factory:0.0.0.0/0.0.0.0:11221:NIOServerCnxnFactory@192]
- Accepted socket connection from /127.0.0.1:48264
    [junit] 2016-05-02 02:41:59,505 [myid:] - INFO  [NIOServerCxn.Factory:0.0.0.0/0.0.0.0:11221:NIOServerCnxn@827]
- Processing stat command from /127.0.0.1:48264
    [junit] 2016-05-02 02:41:59,506 [myid:] - INFO  [Thread-4:NIOServerCnxn$StatCommand@663]
- Stat command output
    [junit] 2016-05-02 02:41:59,507 [myid:] - INFO  [Thread-4:NIOServerCnxn@1008] - Closed
socket connection for client /127.0.0.1:48264 (no session established for client)
    [junit] 2016-05-02 02:41:59,507 [myid:] - INFO  [main:JMXEnv@229] - ensureParent:[InMemoryDataTree,
StandaloneServer_port]
    [junit] 2016-05-02 02:41:59,509 [myid:] - INFO  [main:JMXEnv@246] - expect:InMemoryDataTree
    [junit] 2016-05-02 02:41:59,509 [myid:] - INFO  [main:JMXEnv@250] - found:InMemoryDataTree
org.apache.ZooKeeperService:name0=StandaloneServer_port11221,name1=InMemoryDataTree
    [junit] 2016-05-02 02:41:59,510 [myid:] - INFO  [main:JMXEnv@246] - expect:StandaloneServer_port
    [junit] 2016-05-02 02:41:59,510 [myid:] - INFO  [main:JMXEnv@250] - found:StandaloneServer_port
org.apache.ZooKeeperService:name0=StandaloneServer_port11221
    [junit] 2016-05-02 02:41:59,510 [myid:] - INFO  [main:JUnit4ZKTestRunner$LoggedInvokeMethod@58]
- Memory used 32622
    [junit] 2016-05-02 02:41:59,511 [myid:] - INFO  [main:JUnit4ZKTestRunner$LoggedInvokeMethod@63]
- Number of threads 20
    [junit] 2016-05-02 02:41:59,511 [myid:] - INFO  [main:JUnit4ZKTestRunner$LoggedInvokeMethod@78]
- FINISHED TEST METHOD testQuota
    [junit] 2016-05-02 02:41:59,511 [myid:] - INFO  [main:ClientBase@520] - tearDown starting
    [junit] 2016-05-02 02:41:59,576 [myid:] - INFO  [main:ZooKeeper@684] - Session: 0x1546f5801aa0000
closed
    [junit] 2016-05-02 02:41:59,576 [myid:] - INFO  [main:ClientBase@490] - STOPPING server
    [junit] 2016-05-02 02:41:59,576 [myid:] - INFO  [main-EventThread:ClientCnxn$EventThread@519]
- EventThread shut down for session: 0x1546f5801aa0000
    [junit] 2016-05-02 02:41:59,576 [myid:] - INFO  [NIOServerCxn.Factory:0.0.0.0/0.0.0.0:11221:NIOServerCnxnFactory@219]
- NIOServerCnxn factory exited run method
    [junit] 2016-05-02 02:41:59,577 [myid:] - INFO  [main:ZooKeeperServer@469] - shutting
down
    [junit] 2016-05-02 02:41:59,577 [myid:] - INFO  [main:SessionTrackerImpl@225] - Shutting
down
    [junit] 2016-05-02 02:41:59,577 [myid:] - INFO  [main:PrepRequestProcessor@765] - Shutting
down
    [junit] 2016-05-02 02:41:59,577 [myid:] - INFO  [main:SyncRequestProcessor@209] - Shutting
down
    [junit] 2016-05-02 02:41:59,577 [myid:] - INFO  [ProcessThread(sid:0 cport:11221)::PrepRequestProcessor@143]
- PrepRequestProcessor exited loop!
    [junit] 2016-05-02 02:41:59,578 [myid:] - INFO  [SyncThread:0:SyncRequestProcessor@187]
- SyncRequestProcessor exited!
    [junit] 2016-05-02 02:41:59,578 [myid:] - INFO  [main:FinalRequestProcessor@402] - shutdown
of request processor complete
    [junit] 2016-05-02 02:41:59,579 [myid:] - INFO  [main:FourLetterWordMain@62] - connecting
to 127.0.0.1 11221
    [junit] 2016-05-02 02:41:59,580 [myid:] - INFO  [main:JMXEnv@146] - ensureOnly:[]
    [junit] 2016-05-02 02:41:59,584 [myid:] - INFO  [main:ClientBase@545] - fdcount after
test is: 37 at start it was 25
    [junit] 2016-05-02 02:41:59,584 [myid:] - INFO  [main:ClientBase@547] - sleeping for 20
secs
    [junit] 2016-05-02 02:41:59,585 [myid:] - INFO  [main:ZKTestCase$1@60] - SUCCEEDED testQuota
    [junit] 2016-05-02 02:41:59,585 [myid:] - INFO  [main:ZKTestCase$1@55] - FINISHED testQuota
    [junit] Tests run: 1, Failures: 0, Errors: 0, Skipped: 0, Time elapsed: 0.691 sec

BUILD FAILED
/home/jenkins/jenkins-slave/workspace/ZooKeeper_branch34_jdk7/branch-3.4/build.xml:1320: Tests
failed!

Total time: 28 minutes 52 seconds
Build step 'Execute shell' marked build as failure
Recording test results
Setting LATEST1_7_HOME=/home/jenkins/jenkins-slave/tools/hudson.model.JDK/latest1.7
Setting ANT_LATEST__HOME=/home/jenkins/tools/ant/latest
Email was triggered for: Failure - Any
Sending email for trigger: Failure - Any
Setting LATEST1_7_HOME=/home/jenkins/jenkins-slave/tools/hudson.model.JDK/latest1.7
Setting ANT_LATEST__HOME=/home/jenkins/tools/ant/latest
Setting LATEST1_7_HOME=/home/jenkins/jenkins-slave/tools/hudson.model.JDK/latest1.7
Setting ANT_LATEST__HOME=/home/jenkins/tools/ant/latest



###################################################################################
############################## FAILED TESTS (if any) ##############################
1 tests failed.
FAILED:  org.apache.zookeeper.test.FollowerResyncConcurrencyTest.testResyncBySnapThenDiffAfterFollowerCrashes

Error Message:
Forked Java VM exited abnormally. Please note the time in the report does not reflect the
time until the VM exit.

Stack Trace:
junit.framework.AssertionFailedError: Forked Java VM exited abnormally. Please note the time
in the report does not reflect the time until the VM exit.



Mime
  • Unnamed multipart/mixed (inline, None, 0 bytes)
View raw message