zookeeper-dev mailing list archives

Site index · List index
Message view « Date » · « Thread »
Top « Date » · « Thread »
From Apache Jenkins Server <jenk...@builds.apache.org>
Subject ZooKeeper-trunk - Build # 2908 - Still Failing
Date Mon, 02 May 2016 17:12:34 GMT
See https://builds.apache.org/job/ZooKeeper-trunk/2908/

###################################################################################
########################## LAST 60 LINES OF THE CONSOLE ###########################
[...truncated 300120 lines...]
    [junit] 	at org.jboss.netty.channel.socket.nio.NioWorker.read(NioWorker.java:88)
    [junit] 	at org.jboss.netty.channel.socket.nio.AbstractNioWorker.process(AbstractNioWorker.java:109)
    [junit] 	at org.jboss.netty.channel.socket.nio.AbstractNioSelector.run(AbstractNioSelector.java:312)
    [junit] 	at org.jboss.netty.channel.socket.nio.AbstractNioWorker.run(AbstractNioWorker.java:90)
    [junit] 	at org.jboss.netty.channel.socket.nio.NioWorker.run(NioWorker.java:178)
    [junit] 	at org.jboss.netty.util.ThreadRenamingRunnable.run(ThreadRenamingRunnable.java:108)
    [junit] 	at org.jboss.netty.util.internal.DeadLockProofWorker$1.run(DeadLockProofWorker.java:42)
    [junit] 	at java.util.concurrent.ThreadPoolExecutor.runWorker(ThreadPoolExecutor.java:1145)
    [junit] 	at java.util.concurrent.ThreadPoolExecutor$Worker.run(ThreadPoolExecutor.java:615)
    [junit] 	at java.lang.Thread.run(Thread.java:745)
    [junit] 2016-05-02 17:02:30,813 [myid:127.0.0.1:27395] - INFO  [main-SendThread(127.0.0.1:27395):ClientCnxn$SendThread@1231]
- Unable to read additional data from server sessionid 0x0, likely server has closed socket,
closing socket connection and attempting reconnect
    [junit] 2016-05-02 17:02:30,974 [myid:127.0.0.1:27395] - INFO  [main-SendThread(127.0.0.1:27395):ClientCnxn$SendThread@1113]
- Opening socket connection to server 127.0.0.1/127.0.0.1:27395. Will not attempt to authenticate
using SASL (unknown error)
    [junit] 2016-05-02 17:02:30,974 [myid:127.0.0.1:27395] - INFO  [main-SendThread(127.0.0.1:27395):ClientCnxn$SendThread@948]
- Socket connection established, initiating session, client: /127.0.0.1:40662, server: 127.0.0.1/127.0.0.1:27395
    [junit] 2016-05-02 17:02:30,975 [myid:] - WARN  [New I/O worker #149:NettyServerCnxn@399]
- Closing connection to /127.0.0.1:40662
    [junit] java.io.IOException: ZK down
    [junit] 	at org.apache.zookeeper.server.NettyServerCnxn.receiveMessage(NettyServerCnxn.java:336)
    [junit] 	at org.apache.zookeeper.server.NettyServerCnxnFactory$CnxnChannelHandler.processMessage(NettyServerCnxnFactory.java:244)
    [junit] 	at org.apache.zookeeper.server.NettyServerCnxnFactory$CnxnChannelHandler.messageReceived(NettyServerCnxnFactory.java:166)
    [junit] 	at org.jboss.netty.channel.SimpleChannelHandler.handleUpstream(SimpleChannelHandler.java:88)
    [junit] 	at org.jboss.netty.channel.DefaultChannelPipeline.sendUpstream(DefaultChannelPipeline.java:564)
    [junit] 	at org.jboss.netty.channel.DefaultChannelPipeline.sendUpstream(DefaultChannelPipeline.java:559)
    [junit] 	at org.jboss.netty.channel.Channels.fireMessageReceived(Channels.java:268)
    [junit] 	at org.jboss.netty.channel.Channels.fireMessageReceived(Channels.java:255)
    [junit] 	at org.jboss.netty.channel.socket.nio.NioWorker.read(NioWorker.java:88)
    [junit] 	at org.jboss.netty.channel.socket.nio.AbstractNioWorker.process(AbstractNioWorker.java:109)
    [junit] 	at org.jboss.netty.channel.socket.nio.AbstractNioSelector.run(AbstractNioSelector.java:312)
    [junit] 	at org.jboss.netty.channel.socket.nio.AbstractNioWorker.run(AbstractNioWorker.java:90)
    [junit] 	at org.jboss.netty.channel.socket.nio.NioWorker.run(NioWorker.java:178)
    [junit] 	at org.jboss.netty.util.ThreadRenamingRunnable.run(ThreadRenamingRunnable.java:108)
    [junit] 	at org.jboss.netty.util.internal.DeadLockProofWorker$1.run(DeadLockProofWorker.java:42)
    [junit] 	at java.util.concurrent.ThreadPoolExecutor.runWorker(ThreadPoolExecutor.java:1145)
    [junit] 	at java.util.concurrent.ThreadPoolExecutor$Worker.run(ThreadPoolExecutor.java:615)
    [junit] 	at java.lang.Thread.run(Thread.java:745)
    [junit] 2016-05-02 17:02:30,975 [myid:127.0.0.1:27395] - INFO  [main-SendThread(127.0.0.1:27395):ClientCnxn$SendThread@1231]
- Unable to read additional data from server sessionid 0x0, likely server has closed socket,
closing socket connection and attempting reconnect
    [junit] Running org.apache.zookeeper.test.NioNettySuiteHammerTest in thread 7
    [junit] Tests run: 1, Failures: 0, Errors: 1, Skipped: 0, Time elapsed: 0 sec, Thread:
7, Class: org.apache.zookeeper.test.NioNettySuiteHammerTest
    [junit] Test org.apache.zookeeper.test.NioNettySuiteHammerTest FAILED (timeout)

BUILD FAILED
/home/jenkins/jenkins-slave/workspace/ZooKeeper-trunk/trunk/build.xml:1322: The following
error occurred while executing this line:
/home/jenkins/jenkins-slave/workspace/ZooKeeper-trunk/trunk/build.xml:1207: Tests failed!

Total time: 26 minutes 36 seconds
Build step 'Execute shell' marked build as failure
[FINDBUGS] Skipping publisher since build result is FAILURE
[WARNINGS] Skipping publisher since build result is FAILURE
Archiving artifacts
Setting LATEST1_7_HOME=/home/jenkins/jenkins-slave/tools/hudson.model.JDK/latest1.7
Recording fingerprints
Setting LATEST1_7_HOME=/home/jenkins/jenkins-slave/tools/hudson.model.JDK/latest1.7
Updating ZOOKEEPER-2139
Recording test results
Setting LATEST1_7_HOME=/home/jenkins/jenkins-slave/tools/hudson.model.JDK/latest1.7
Publishing Javadoc
Setting LATEST1_7_HOME=/home/jenkins/jenkins-slave/tools/hudson.model.JDK/latest1.7
Email was triggered for: Failure - Any
Sending email for trigger: Failure - Any
Setting LATEST1_7_HOME=/home/jenkins/jenkins-slave/tools/hudson.model.JDK/latest1.7
Setting LATEST1_7_HOME=/home/jenkins/jenkins-slave/tools/hudson.model.JDK/latest1.7



###################################################################################
############################## FAILED TESTS (if any) ##############################
39 tests failed.
FAILED:  org.apache.zookeeper.server.ZooKeeperServerMainTest.testWithAutoCreateDataLogDir

Error Message:
KeeperErrorCode = ConnectionLoss for /foo

Stack Trace:
org.apache.zookeeper.KeeperException$ConnectionLossException: KeeperErrorCode = ConnectionLoss
for /foo
	at org.apache.zookeeper.KeeperException.create(KeeperException.java:99)
	at org.apache.zookeeper.KeeperException.create(KeeperException.java:51)
	at org.apache.zookeeper.ZooKeeper.create(ZooKeeper.java:1412)
	at org.apache.zookeeper.server.ZooKeeperServerMainTest.testWithAutoCreateDataLogDir(ZooKeeperServerMainTest.java:217)
	at org.apache.zookeeper.JUnit4ZKTestRunner$LoggedInvokeMethod.evaluate(JUnit4ZKTestRunner.java:79)
	at java.util.concurrent.FutureTask.run(FutureTask.java:262)
	at java.lang.Thread.run(Thread.java:745)


FAILED:  org.apache.zookeeper.server.ZxidRolloverTest.testRolloverThenRestart

Error Message:
waiting for server up

Stack Trace:
junit.framework.AssertionFailedError: waiting for server up
	at org.apache.zookeeper.test.QuorumUtil.startAll(QuorumUtil.java:151)
	at org.apache.zookeeper.server.ZxidRolloverTest.startAll(ZxidRolloverTest.java:151)
	at org.apache.zookeeper.server.ZxidRolloverTest.testRolloverThenRestart(ZxidRolloverTest.java:295)
	at org.apache.zookeeper.JUnit4ZKTestRunner$LoggedInvokeMethod.evaluate(JUnit4ZKTestRunner.java:79)


FAILED:  org.apache.zookeeper.server.quorum.QuorumPeerMainTest.testEarlyLeaderAbandonment

Error Message:
Waiting too long

Stack Trace:
java.lang.RuntimeException: Waiting too long
	at org.apache.zookeeper.server.quorum.QuorumPeerMainTest.waitForOne(QuorumPeerMainTest.java:342)
	at org.apache.zookeeper.server.quorum.QuorumPeerMainTest.testEarlyLeaderAbandonment(QuorumPeerMainTest.java:215)
	at org.apache.zookeeper.JUnit4ZKTestRunner$LoggedInvokeMethod.evaluate(JUnit4ZKTestRunner.java:79)


FAILED:  org.apache.zookeeper.server.quorum.QuorumPeerMainTest.testWithOnlyMinSessionTimeout

Error Message:
waiting for server 1 being up

Stack Trace:
junit.framework.AssertionFailedError: waiting for server 1 being up
	at org.apache.zookeeper.server.quorum.QuorumPeerMainTest.testWithOnlyMinSessionTimeout(QuorumPeerMainTest.java:771)
	at org.apache.zookeeper.JUnit4ZKTestRunner$LoggedInvokeMethod.evaluate(JUnit4ZKTestRunner.java:79)


FAILED:  org.apache.zookeeper.server.quorum.QuorumRequestPipelineTest.testExists[1]

Error Message:
Timeout occurred. Please note the time in the report does not reflect the time until the timeout.

Stack Trace:
junit.framework.AssertionFailedError: Timeout occurred. Please note the time in the report
does not reflect the time until the timeout.
	at java.lang.Thread.run(Thread.java:745)


FAILED:  org.apache.zookeeper.server.quorum.ReconfigBackupTest.testBackupStatic

Error Message:
waiting for server 0 being up

Stack Trace:
junit.framework.AssertionFailedError: waiting for server 0 being up
	at org.apache.zookeeper.server.quorum.ReconfigBackupTest.testBackupStatic(ReconfigBackupTest.java:99)
	at org.apache.zookeeper.JUnit4ZKTestRunner$LoggedInvokeMethod.evaluate(JUnit4ZKTestRunner.java:79)


FAILED:  org.apache.zookeeper.server.quorum.ReconfigLegacyTest.testConfigFileBackwardCompatibility

Error Message:
waiting for server 0 being up

Stack Trace:
junit.framework.AssertionFailedError: waiting for server 0 being up
	at org.apache.zookeeper.server.quorum.ReconfigLegacyTest.testConfigFileBackwardCompatibility(ReconfigLegacyTest.java:87)
	at org.apache.zookeeper.JUnit4ZKTestRunner$LoggedInvokeMethod.evaluate(JUnit4ZKTestRunner.java:79)


FAILED:  org.apache.zookeeper.test.AsyncHammerTest.testHammer

Error Message:
waiting for server up

Stack Trace:
junit.framework.AssertionFailedError: waiting for server up
	at org.apache.zookeeper.test.QuorumBase.startServers(QuorumBase.java:223)
	at org.apache.zookeeper.test.QuorumBase.setUp(QuorumBase.java:120)
	at org.apache.zookeeper.test.AsyncHammerTest.setUp(AsyncHammerTest.java:52)
	at org.apache.zookeeper.test.AsyncHammerTest.testHammer(AsyncHammerTest.java:171)
	at org.apache.zookeeper.JUnit4ZKTestRunner$LoggedInvokeMethod.evaluate(JUnit4ZKTestRunner.java:79)


FAILED:  org.apache.zookeeper.test.FLETest.testDoubleElection

Error Message:
Fewer than a a majority has joined

Stack Trace:
junit.framework.AssertionFailedError: Fewer than a a majority has joined
	at org.apache.zookeeper.test.FLETest.runElection(FLETest.java:361)
	at org.apache.zookeeper.test.FLETest.testDoubleElection(FLETest.java:277)
	at org.apache.zookeeper.JUnit4ZKTestRunner$LoggedInvokeMethod.evaluate(JUnit4ZKTestRunner.java:79)


FAILED:  org.apache.zookeeper.test.FLETest.testJoinInconsistentEnsemble

Error Message:
Unable to form cluster in 10000 ms

Stack Trace:
junit.framework.AssertionFailedError: Unable to form cluster in 10000 ms
	at org.apache.zookeeper.test.FLETest.testJoinInconsistentEnsemble(FLETest.java:499)
	at org.apache.zookeeper.JUnit4ZKTestRunner$LoggedInvokeMethod.evaluate(JUnit4ZKTestRunner.java:79)


FAILED:  org.apache.zookeeper.test.FLEZeroWeightTest.testZeroWeightQuorum

Error Message:
Threads didn't join

Stack Trace:
junit.framework.AssertionFailedError: Threads didn't join
	at org.apache.zookeeper.test.FLEZeroWeightTest.testZeroWeightQuorum(FLEZeroWeightTest.java:167)
	at org.apache.zookeeper.JUnit4ZKTestRunner$LoggedInvokeMethod.evaluate(JUnit4ZKTestRunner.java:79)


FAILED:  org.apache.zookeeper.test.FourLetterWordsQuorumTest.testFourLetterWords

Error Message:
Exception while executing four letter word: dirs

Stack Trace:
java.io.IOException: Exception while executing four letter word: dirs
	at org.apache.zookeeper.client.FourLetterWordMain.send4LetterWord(FourLetterWordMain.java:124)
	at org.apache.zookeeper.client.FourLetterWordMain.send4LetterWord(FourLetterWordMain.java:54)
	at org.apache.zookeeper.test.FourLetterWordsQuorumTest.verify(FourLetterWordsQuorumTest.java:109)
	at org.apache.zookeeper.test.FourLetterWordsQuorumTest.testFourLetterWords(FourLetterWordsQuorumTest.java:78)
	at org.apache.zookeeper.JUnit4ZKTestRunner$LoggedInvokeMethod.evaluate(JUnit4ZKTestRunner.java:79)
Caused by: java.net.SocketTimeoutException: Read timed out
	at java.net.SocketInputStream.socketRead0(Native Method)
	at java.net.SocketInputStream.read(SocketInputStream.java:152)
	at java.net.SocketInputStream.read(SocketInputStream.java:122)
	at sun.nio.cs.StreamDecoder.readBytes(StreamDecoder.java:283)
	at sun.nio.cs.StreamDecoder.implRead(StreamDecoder.java:325)
	at sun.nio.cs.StreamDecoder.read(StreamDecoder.java:177)
	at java.io.InputStreamReader.read(InputStreamReader.java:184)
	at java.io.BufferedReader.fill(BufferedReader.java:154)
	at java.io.BufferedReader.readLine(BufferedReader.java:317)
	at java.io.BufferedReader.readLine(BufferedReader.java:382)
	at org.apache.zookeeper.client.FourLetterWordMain.send4LetterWord(FourLetterWordMain.java:119)


FAILED:  org.apache.zookeeper.test.FourLetterWordsQuorumTest.testNull

Error Message:
waiting for server up

Stack Trace:
junit.framework.AssertionFailedError: waiting for server up
	at org.apache.zookeeper.test.QuorumBase.startServers(QuorumBase.java:223)
	at org.apache.zookeeper.test.QuorumBase.setUp(QuorumBase.java:120)
	at org.apache.zookeeper.test.QuorumBase.setUp(QuorumBase.java:78)


FAILED:  org.apache.zookeeper.test.LETest.testLE

Error Message:
Threads didn't join

Stack Trace:
junit.framework.AssertionFailedError: Threads didn't join
	at org.apache.zookeeper.test.LETest.testLE(LETest.java:123)
	at org.apache.zookeeper.JUnit4ZKTestRunner$LoggedInvokeMethod.evaluate(JUnit4ZKTestRunner.java:79)


FAILED:  org.apache.zookeeper.test.AsyncHammerTest.testHammer

Error Message:
null

Stack Trace:
junit.framework.AssertionFailedError
	at org.apache.zookeeper.test.AsyncHammerTest.testHammer(AsyncHammerTest.java:186)
	at org.apache.zookeeper.JUnit4ZKTestRunner$LoggedInvokeMethod.evaluate(JUnit4ZKTestRunner.java:79)


FAILED:  org.apache.zookeeper.test.AsyncHammerTest.testObserversHammer

Error Message:
thread HammerThread-0 still alive after join

Stack Trace:
junit.framework.AssertionFailedError: thread HammerThread-0 still alive after join
	at org.apache.zookeeper.test.ClientBase.verifyThreadTerminated(ClientBase.java:317)
	at org.apache.zookeeper.test.AsyncHammerTest.testObserversHammer(AsyncHammerTest.java:214)
	at org.apache.zookeeper.JUnit4ZKTestRunner$LoggedInvokeMethod.evaluate(JUnit4ZKTestRunner.java:79)


FAILED:  org.apache.zookeeper.test.FourLetterWordsTest.testFourLetterWords

Error Message:
Exception while executing four letter word: srst

Stack Trace:
java.io.IOException: Exception while executing four letter word: srst
	at org.apache.zookeeper.client.FourLetterWordMain.send4LetterWord(FourLetterWordMain.java:124)
	at org.apache.zookeeper.client.FourLetterWordMain.send4LetterWord(FourLetterWordMain.java:54)
	at org.apache.zookeeper.test.FourLetterWordsTest.sendRequest(FourLetterWordsTest.java:120)
	at org.apache.zookeeper.test.FourLetterWordsTest.verify(FourLetterWordsTest.java:128)
	at org.apache.zookeeper.test.FourLetterWordsTest.testFourLetterWords(FourLetterWordsTest.java:105)
	at org.apache.zookeeper.JUnit4ZKTestRunner$LoggedInvokeMethod.evaluate(JUnit4ZKTestRunner.java:79)
	at java.util.concurrent.FutureTask.run(FutureTask.java:262)
	at java.lang.Thread.run(Thread.java:745)
Caused by: java.net.SocketTimeoutException: Read timed out
	at java.net.SocketInputStream.socketRead0(Native Method)
	at java.net.SocketInputStream.read(SocketInputStream.java:152)
	at java.net.SocketInputStream.read(SocketInputStream.java:122)
	at sun.nio.cs.StreamDecoder.readBytes(StreamDecoder.java:283)
	at sun.nio.cs.StreamDecoder.implRead(StreamDecoder.java:325)
	at sun.nio.cs.StreamDecoder.read(StreamDecoder.java:177)
	at java.io.InputStreamReader.read(InputStreamReader.java:184)
	at java.io.BufferedReader.fill(BufferedReader.java:154)
	at java.io.BufferedReader.readLine(BufferedReader.java:317)
	at java.io.BufferedReader.readLine(BufferedReader.java:382)
	at org.apache.zookeeper.client.FourLetterWordMain.send4LetterWord(FourLetterWordMain.java:119)


FAILED:  org.apache.zookeeper.test.WatcherTest.testWatcherAutoResetWithGlobal

Error Message:
Did not connect

Stack Trace:
java.util.concurrent.TimeoutException: Did not connect
	at org.apache.zookeeper.test.ClientBase$CountdownWatcher.waitForConnected(ClientBase.java:132)
	at org.apache.zookeeper.test.WatcherTest.testWatcherAutoReset(WatcherTest.java:283)
	at org.apache.zookeeper.test.WatcherTest.testWatcherAutoResetWithGlobal(WatcherTest.java:231)
	at org.apache.zookeeper.JUnit4ZKTestRunner$LoggedInvokeMethod.evaluate(JUnit4ZKTestRunner.java:79)


FAILED:  org.apache.zookeeper.test.NioNettySuiteHammerTest.testHammer

Error Message:
Timeout occurred. Please note the time in the report does not reflect the time until the timeout.

Stack Trace:
junit.framework.AssertionFailedError: Timeout occurred. Please note the time in the report
does not reflect the time until the timeout.
	at java.lang.Thread.run(Thread.java:745)


FAILED:  org.apache.zookeeper.test.SessionTest.testSessionTimeout

Error Message:
EventThread is still running

Stack Trace:
junit.framework.AssertionFailedError: EventThread is still running
	at org.apache.zookeeper.test.SessionTest.testSessionTimeout(SessionTest.java:287)
	at org.apache.zookeeper.JUnit4ZKTestRunner$LoggedInvokeMethod.evaluate(JUnit4ZKTestRunner.java:79)


FAILED:  org.apache.zookeeper.test.QuorumHammerTest.testHammerBasic

Error Message:
waiting for server up

Stack Trace:
junit.framework.AssertionFailedError: waiting for server up
	at org.apache.zookeeper.test.QuorumBase.startServers(QuorumBase.java:223)
	at org.apache.zookeeper.test.QuorumBase.setUp(QuorumBase.java:120)
	at org.apache.zookeeper.test.QuorumBase.setUp(QuorumBase.java:78)
	at org.apache.zookeeper.test.QuorumHammerTest.setUp(QuorumHammerTest.java:36)


FAILED:  org.apache.zookeeper.test.QuorumMajorityTest.testMajQuorums

Error Message:
waiting for server up

Stack Trace:
junit.framework.AssertionFailedError: waiting for server up
	at org.apache.zookeeper.test.QuorumBase.startServers(QuorumBase.java:223)
	at org.apache.zookeeper.test.QuorumBase.setUp(QuorumBase.java:120)
	at org.apache.zookeeper.test.QuorumMajorityTest.testMajQuorums(QuorumMajorityTest.java:41)
	at org.apache.zookeeper.JUnit4ZKTestRunner$LoggedInvokeMethod.evaluate(JUnit4ZKTestRunner.java:79)


FAILED:  org.apache.zookeeper.test.QuorumMajorityTest.testNull

Error Message:
waiting for server up

Stack Trace:
junit.framework.AssertionFailedError: waiting for server up
	at org.apache.zookeeper.test.QuorumBase.startServers(QuorumBase.java:223)
	at org.apache.zookeeper.test.QuorumBase.setUp(QuorumBase.java:120)
	at org.apache.zookeeper.test.QuorumBase.setUp(QuorumBase.java:78)


FAILED:  org.apache.zookeeper.test.QuorumQuotaTest.testQuotaWithQuorum

Error Message:
KeeperErrorCode = ConnectionLoss for /a/301

Stack Trace:
org.apache.zookeeper.KeeperException$ConnectionLossException: KeeperErrorCode = ConnectionLoss
for /a/301
	at org.apache.zookeeper.KeeperException.create(KeeperException.java:99)
	at org.apache.zookeeper.KeeperException.create(KeeperException.java:51)
	at org.apache.zookeeper.ZooKeeper.create(ZooKeeper.java:1412)
	at org.apache.zookeeper.test.QuorumQuotaTest.testQuotaWithQuorum(QuorumQuotaTest.java:51)
	at org.apache.zookeeper.JUnit4ZKTestRunner$LoggedInvokeMethod.evaluate(JUnit4ZKTestRunner.java:79)


FAILED:  org.apache.zookeeper.test.QuorumQuotaTest.testNull

Error Message:
waiting for server up

Stack Trace:
junit.framework.AssertionFailedError: waiting for server up
	at org.apache.zookeeper.test.QuorumBase.startServers(QuorumBase.java:223)
	at org.apache.zookeeper.test.QuorumBase.setUp(QuorumBase.java:120)
	at org.apache.zookeeper.test.QuorumBase.setUp(QuorumBase.java:78)


FAILED:  org.apache.zookeeper.test.QuorumTest.testACLs

Error Message:
waiting for server up

Stack Trace:
junit.framework.AssertionFailedError: waiting for server up
	at org.apache.zookeeper.test.QuorumBase.startServers(QuorumBase.java:223)
	at org.apache.zookeeper.test.QuorumBase.setUp(QuorumBase.java:120)
	at org.apache.zookeeper.test.QuorumBase.setUp(QuorumBase.java:78)
	at org.apache.zookeeper.test.QuorumTest.setUp(QuorumTest.java:60)


FAILED:  org.apache.zookeeper.test.QuorumTest.testNoLogBeforeLeaderEstablishment

Error Message:
waiting for server up

Stack Trace:
junit.framework.AssertionFailedError: waiting for server up
	at org.apache.zookeeper.test.QuorumBase.startServers(QuorumBase.java:223)
	at org.apache.zookeeper.test.QuorumBase.setUp(QuorumBase.java:120)
	at org.apache.zookeeper.test.QuorumBase.setUp(QuorumBase.java:78)
	at org.apache.zookeeper.test.QuorumTest.setUp(QuorumTest.java:60)


FAILED:  org.apache.zookeeper.test.QuorumTest.testGetView

Error Message:
waiting for server up

Stack Trace:
junit.framework.AssertionFailedError: waiting for server up
	at org.apache.zookeeper.test.QuorumBase.startServers(QuorumBase.java:223)
	at org.apache.zookeeper.test.QuorumBase.setUp(QuorumBase.java:120)
	at org.apache.zookeeper.test.QuorumBase.setUp(QuorumBase.java:78)
	at org.apache.zookeeper.test.QuorumTest.setUp(QuorumTest.java:60)


FAILED:  org.apache.zookeeper.test.QuorumTest.testDeleteWithChildren

Error Message:
waiting for server up

Stack Trace:
junit.framework.AssertionFailedError: waiting for server up
	at org.apache.zookeeper.test.QuorumBase.startServers(QuorumBase.java:223)
	at org.apache.zookeeper.test.QuorumBase.setUp(QuorumBase.java:120)
	at org.apache.zookeeper.test.QuorumBase.setUp(QuorumBase.java:78)
	at org.apache.zookeeper.test.QuorumTest.setUp(QuorumTest.java:60)


FAILED:  org.apache.zookeeper.test.QuorumZxidSyncTest.testBehindLeader

Error Message:
waiting for server up

Stack Trace:
junit.framework.AssertionFailedError: waiting for server up
	at org.apache.zookeeper.test.QuorumBase.startServers(QuorumBase.java:223)
	at org.apache.zookeeper.test.QuorumBase.startServers(QuorumBase.java:132)
	at org.apache.zookeeper.test.QuorumZxidSyncTest.testBehindLeader(QuorumZxidSyncTest.java:59)
	at org.apache.zookeeper.JUnit4ZKTestRunner$LoggedInvokeMethod.evaluate(JUnit4ZKTestRunner.java:79)


FAILED:  org.apache.zookeeper.test.QuorumZxidSyncTest.testLateLogs

Error Message:
waiting for server up

Stack Trace:
junit.framework.AssertionFailedError: waiting for server up
	at org.apache.zookeeper.test.QuorumBase.startServers(QuorumBase.java:223)
	at org.apache.zookeeper.test.QuorumBase.startServers(QuorumBase.java:132)
	at org.apache.zookeeper.test.QuorumZxidSyncTest.testLateLogs(QuorumZxidSyncTest.java:116)
	at org.apache.zookeeper.JUnit4ZKTestRunner$LoggedInvokeMethod.evaluate(JUnit4ZKTestRunner.java:79)


FAILED:  org.apache.zookeeper.test.ReadOnlyModeTest.testSessionEstablishment

Error Message:
waiting for server up

Stack Trace:
junit.framework.AssertionFailedError: waiting for server up
	at org.apache.zookeeper.test.ReadOnlyModeTest.testSessionEstablishment(ReadOnlyModeTest.java:235)
	at org.apache.zookeeper.JUnit4ZKTestRunner$LoggedInvokeMethod.evaluate(JUnit4ZKTestRunner.java:79)
	at java.util.concurrent.FutureTask.run(FutureTask.java:262)
	at java.lang.Thread.run(Thread.java:745)


FAILED:  org.apache.zookeeper.test.ReadOnlyModeTest.testConnectionEvents

Error Message:
Waiting for server up

Stack Trace:
junit.framework.AssertionFailedError: Waiting for server up
	at org.apache.zookeeper.test.QuorumUtil.startQuorum(QuorumUtil.java:196)
	at org.apache.zookeeper.test.ReadOnlyModeTest.setUp(ReadOnlyModeTest.java:58)


FAILED:  org.apache.zookeeper.test.ReconfigTest.testQuorumSystemChange

Error Message:
KeeperErrorCode = Session expired for /test

Stack Trace:
org.apache.zookeeper.KeeperException$SessionExpiredException: KeeperErrorCode = Session expired
for /test
	at org.apache.zookeeper.KeeperException.create(KeeperException.java:131)
	at org.apache.zookeeper.KeeperException.create(KeeperException.java:51)
	at org.apache.zookeeper.ZooKeeper.getData(ZooKeeper.java:1956)
	at org.apache.zookeeper.test.ReconfigTest.testNormalOperation(ReconfigTest.java:149)
	at org.apache.zookeeper.test.ReconfigTest.testQuorumSystemChange(ReconfigTest.java:704)
	at org.apache.zookeeper.JUnit4ZKTestRunner$LoggedInvokeMethod.evaluate(JUnit4ZKTestRunner.java:79)


FAILED:  org.apache.zookeeper.test.ReconfigTest.testRemoveAddTwo

Error Message:
KeeperErrorCode = Session expired for /test

Stack Trace:
org.apache.zookeeper.KeeperException$SessionExpiredException: KeeperErrorCode = Session expired
for /test
	at org.apache.zookeeper.KeeperException.create(KeeperException.java:131)
	at org.apache.zookeeper.KeeperException.create(KeeperException.java:51)
	at org.apache.zookeeper.ZooKeeper.create(ZooKeeper.java:1412)
	at org.apache.zookeeper.test.ReconfigTest.testNormalOperation(ReconfigTest.java:140)
	at org.apache.zookeeper.test.ReconfigTest.testRemoveAddTwo(ReconfigTest.java:357)
	at org.apache.zookeeper.JUnit4ZKTestRunner$LoggedInvokeMethod.evaluate(JUnit4ZKTestRunner.java:79)


FAILED:  org.apache.zookeeper.test.SessionUpgradeTest.testLocalSessionsWithoutEphemeralOnLeader

Error Message:
waiting for server up

Stack Trace:
junit.framework.AssertionFailedError: waiting for server up
	at org.apache.zookeeper.test.QuorumBase.startServers(QuorumBase.java:223)
	at org.apache.zookeeper.test.QuorumBase.setUp(QuorumBase.java:120)
	at org.apache.zookeeper.test.QuorumBase.setUp(QuorumBase.java:78)
	at org.apache.zookeeper.test.SessionUpgradeTest.setUp(SessionUpgradeTest.java:52)


FAILED:  org.apache.zookeeper.test.SessionUpgradeTest.testUpgradeWithEphemeralOnLeader

Error Message:
waiting for server up

Stack Trace:
junit.framework.AssertionFailedError: waiting for server up
	at org.apache.zookeeper.test.QuorumBase.startServers(QuorumBase.java:223)
	at org.apache.zookeeper.test.QuorumBase.setUp(QuorumBase.java:120)
	at org.apache.zookeeper.test.QuorumBase.setUp(QuorumBase.java:78)
	at org.apache.zookeeper.test.SessionUpgradeTest.setUp(SessionUpgradeTest.java:52)


FAILED:  org.apache.zookeeper.test.WatchEventWhenAutoResetTest.testNodeDataChanged

Error Message:
KeeperErrorCode = ConnectionLoss for /test-changed

Stack Trace:
org.apache.zookeeper.KeeperException$ConnectionLossException: KeeperErrorCode = ConnectionLoss
for /test-changed
	at org.apache.zookeeper.KeeperException.create(KeeperException.java:99)
	at org.apache.zookeeper.KeeperException.create(KeeperException.java:51)
	at org.apache.zookeeper.ZooKeeper.delete(ZooKeeper.java:1618)
	at org.apache.zookeeper.test.WatchEventWhenAutoResetTest.testNodeDataChanged(WatchEventWhenAutoResetTest.java:112)
	at org.apache.zookeeper.JUnit4ZKTestRunner$LoggedInvokeMethod.evaluate(JUnit4ZKTestRunner.java:79)


FAILED:  org.apache.zookeeper.test.ZkDatabaseCorruptionTest.testCorruption

Error Message:
waiting for server up

Stack Trace:
junit.framework.AssertionFailedError: waiting for server up
	at org.apache.zookeeper.test.QuorumBase.startServers(QuorumBase.java:223)
	at org.apache.zookeeper.test.QuorumBase.setUp(QuorumBase.java:120)
	at org.apache.zookeeper.test.QuorumBase.setUp(QuorumBase.java:78)
	at org.apache.zookeeper.test.ZkDatabaseCorruptionTest.setUp(ZkDatabaseCorruptionTest.java:53)



Mime
  • Unnamed multipart/mixed (inline, None, 0 bytes)
View raw message