zookeeper-dev mailing list archives

Site index · List index
Message view « Date » · « Thread »
Top « Date » · « Thread »
From Apache Jenkins Server <jenk...@builds.apache.org>
Subject ZooKeeper-trunk-jdk8 - Build # 584 - Still Failing
Date Mon, 02 May 2016 23:05:57 GMT
See https://builds.apache.org/job/ZooKeeper-trunk-jdk8/584/

###################################################################################
########################## LAST 60 LINES OF THE CONSOLE ###########################
[...truncated 543611 lines...]
    [junit] 2016-05-02 23:05:49,856 [myid:] - INFO  [main:FileTxnSnapLog@298] - Snapshotting:
0x6 to /home/jenkins/jenkins-slave/workspace/ZooKeeper-trunk-jdk8/trunk/build/test/tmp/test7891382266243108788.junit.dir/version-2/snapshot.6
    [junit] 2016-05-02 23:05:49,858 [myid:] - INFO  [main:FourLetterWordMain@85] - connecting
to 127.0.0.1 16614
    [junit] 2016-05-02 23:05:49,859 [myid:] - INFO  [NIOServerCxnFactory.AcceptThread:0.0.0.0/0.0.0.0:16614:NIOServerCnxnFactory$AcceptThread@296]
- Accepted socket connection from /127.0.0.1:60859
    [junit] 2016-05-02 23:05:49,859 [myid:] - INFO  [NIOWorkerThread-1:NIOServerCnxn@485]
- Processing stat command from /127.0.0.1:60859
    [junit] 2016-05-02 23:05:49,860 [myid:] - INFO  [NIOWorkerThread-1:StatCommand@49] - Stat
command output
    [junit] 2016-05-02 23:05:49,862 [myid:] - INFO  [NIOWorkerThread-1:NIOServerCnxn@607]
- Closed socket connection for client /127.0.0.1:60859 (no session established for client)
    [junit] 2016-05-02 23:05:49,862 [myid:] - INFO  [main:JMXEnv@228] - ensureParent:[InMemoryDataTree,
StandaloneServer_port]
    [junit] 2016-05-02 23:05:49,864 [myid:] - INFO  [main:JMXEnv@245] - expect:InMemoryDataTree
    [junit] 2016-05-02 23:05:49,864 [myid:] - INFO  [main:JMXEnv@249] - found:InMemoryDataTree
org.apache.ZooKeeperService:name0=StandaloneServer_port16614,name1=InMemoryDataTree
    [junit] 2016-05-02 23:05:49,864 [myid:] - INFO  [main:JMXEnv@245] - expect:StandaloneServer_port
    [junit] 2016-05-02 23:05:49,864 [myid:] - INFO  [main:JMXEnv@249] - found:StandaloneServer_port
org.apache.ZooKeeperService:name0=StandaloneServer_port16614
    [junit] 2016-05-02 23:05:50,279 [myid:] - INFO  [SessionTracker:SessionTrackerImpl@158]
- SessionTrackerImpl exited loop!
    [junit] 2016-05-02 23:05:50,279 [myid:] - INFO  [SessionTracker:SessionTrackerImpl@158]
- SessionTrackerImpl exited loop!
    [junit] 2016-05-02 23:05:51,161 [myid:127.0.0.1:16614] - INFO  [main-SendThread(127.0.0.1:16614):ClientCnxn$SendThread@1113]
- Opening socket connection to server 127.0.0.1/127.0.0.1:16614. Will not attempt to authenticate
using SASL (unknown error)
    [junit] 2016-05-02 23:05:51,162 [myid:] - INFO  [NIOServerCxnFactory.AcceptThread:0.0.0.0/0.0.0.0:16614:NIOServerCnxnFactory$AcceptThread@296]
- Accepted socket connection from /127.0.0.1:60886
    [junit] 2016-05-02 23:05:51,162 [myid:127.0.0.1:16614] - INFO  [main-SendThread(127.0.0.1:16614):ClientCnxn$SendThread@948]
- Socket connection established, initiating session, client: /127.0.0.1:60886, server: 127.0.0.1/127.0.0.1:16614
    [junit] 2016-05-02 23:05:51,163 [myid:] - INFO  [NIOWorkerThread-2:ZooKeeperServer@969]
- Client attempting to renew session 0x1027d268eb40000 at /127.0.0.1:60886
    [junit] 2016-05-02 23:05:51,164 [myid:] - INFO  [NIOWorkerThread-2:ZooKeeperServer@678]
- Established session 0x1027d268eb40000 with negotiated timeout 6000 for client /127.0.0.1:60886
    [junit] 2016-05-02 23:05:51,164 [myid:127.0.0.1:16614] - INFO  [main-SendThread(127.0.0.1:16614):ClientCnxn$SendThread@1381]
- Session establishment complete on server 127.0.0.1/127.0.0.1:16614, sessionid = 0x1027d268eb40000,
negotiated timeout = 6000
    [junit] 2016-05-02 23:05:51,173 [myid:] - INFO  [SyncThread:0:FileTxnLog@204] - Creating
new log file: log.7
    [junit] 2016-05-02 23:05:52,230 [myid:] - INFO  [ProcessThread(sid:0 cport:16614)::PrepRequestProcessor@647]
- Processed session termination for sessionid: 0x1027d268eb40000
    [junit] 2016-05-02 23:05:52,245 [myid:] - INFO  [main:ZooKeeper@1313] - Session: 0x1027d268eb40000
closed
    [junit] 2016-05-02 23:05:52,245 [myid:] - INFO  [main:JUnit4ZKTestRunner$LoggedInvokeMethod@82]
- Memory used 6042
    [junit] 2016-05-02 23:05:52,245 [myid:] - INFO  [main:JUnit4ZKTestRunner$LoggedInvokeMethod@87]
- Number of threads 32
    [junit] 2016-05-02 23:05:52,245 [myid:] - INFO  [main:JUnit4ZKTestRunner$LoggedInvokeMethod@102]
- FINISHED TEST METHOD testWatcherAutoResetWithLocal
    [junit] 2016-05-02 23:05:52,246 [myid:] - INFO  [main:ClientBase@537] - tearDown starting
    [junit] 2016-05-02 23:05:52,246 [myid:] - INFO  [main-EventThread:ClientCnxn$EventThread@513]
- EventThread shut down for session: 0x1027d268eb40000
    [junit] 2016-05-02 23:05:52,247 [myid:] - INFO  [main:ClientBase@507] - STOPPING server
    [junit] 2016-05-02 23:05:52,249 [myid:] - INFO  [NIOServerCxnFactory.AcceptThread:0.0.0.0/0.0.0.0:16614:NIOServerCnxnFactory$AcceptThread@219]
- accept thread exitted run method
    [junit] 2016-05-02 23:05:52,250 [myid:] - INFO  [NIOServerCxnFactory.SelectorThread-1:NIOServerCnxnFactory$SelectorThread@420]
- selector thread exitted run method
    [junit] 2016-05-02 23:05:52,250 [myid:] - INFO  [NIOServerCxnFactory.SelectorThread-0:NIOServerCnxnFactory$SelectorThread@420]
- selector thread exitted run method
    [junit] 2016-05-02 23:05:52,251 [myid:] - INFO  [ConnnectionExpirer:NIOServerCnxnFactory$ConnectionExpirerThread@583]
- ConnnectionExpirerThread interrupted
    [junit] 2016-05-02 23:05:52,254 [myid:] - INFO  [NIOWorkerThread-11:MBeanRegistry@128]
- Unregister MBean [org.apache.ZooKeeperService:name0=StandaloneServer_port16614,name1=Connections,name2=127.0.0.1,name3=0x1027d268eb40000]
    [junit] 2016-05-02 23:05:52,258 [myid:] - INFO  [NIOWorkerThread-11:NIOServerCnxn@607]
- Closed socket connection for client /127.0.0.1:60886 which had sessionid 0x1027d268eb40000
    [junit] 2016-05-02 23:05:52,259 [myid:] - INFO  [main:ZooKeeperServer@498] - shutting
down
    [junit] 2016-05-02 23:05:52,259 [myid:] - INFO  [main:SessionTrackerImpl@232] - Shutting
down
    [junit] 2016-05-02 23:05:52,259 [myid:] - INFO  [main:PrepRequestProcessor@965] - Shutting
down
    [junit] 2016-05-02 23:05:52,259 [myid:] - INFO  [main:SyncRequestProcessor@191] - Shutting
down
    [junit] 2016-05-02 23:05:52,260 [myid:] - INFO  [ProcessThread(sid:0 cport:16614)::PrepRequestProcessor@154]
- PrepRequestProcessor exited loop!
    [junit] 2016-05-02 23:05:52,260 [myid:] - INFO  [SyncThread:0:SyncRequestProcessor@169]
- SyncRequestProcessor exited!
    [junit] 2016-05-02 23:05:52,261 [myid:] - INFO  [main:FinalRequestProcessor@479] - shutdown
of request processor complete
    [junit] 2016-05-02 23:05:52,261 [myid:] - INFO  [main:MBeanRegistry@128] - Unregister
MBean [org.apache.ZooKeeperService:name0=StandaloneServer_port16614,name1=InMemoryDataTree]
    [junit] 2016-05-02 23:05:52,262 [myid:] - INFO  [main:MBeanRegistry@128] - Unregister
MBean [org.apache.ZooKeeperService:name0=StandaloneServer_port16614]
    [junit] 2016-05-02 23:05:52,263 [myid:] - INFO  [main:FourLetterWordMain@85] - connecting
to 127.0.0.1 16614
    [junit] 2016-05-02 23:05:52,264 [myid:] - INFO  [main:JMXEnv@146] - ensureOnly:[]
    [junit] 2016-05-02 23:05:52,288 [myid:] - INFO  [main:ClientBase@562] - fdcount after
test is: 51 at start it was 51
    [junit] 2016-05-02 23:05:52,288 [myid:] - INFO  [main:ZKTestCase$1@65] - SUCCEEDED testWatcherAutoResetWithLocal
    [junit] 2016-05-02 23:05:52,288 [myid:] - INFO  [main:ZKTestCase$1@60] - FINISHED testWatcherAutoResetWithLocal
    [junit] Tests run: 7, Failures: 0, Errors: 0, Skipped: 0, Time elapsed: 33.525 sec, Thread:
3, Class: org.apache.zookeeper.test.WatcherTest

BUILD FAILED
/home/jenkins/jenkins-slave/workspace/ZooKeeper-trunk-jdk8/trunk/build.xml:1207: Tests failed!

Total time: 10 minutes 38 seconds
Build step 'Invoke Ant' marked build as failure
[WARNINGS] Skipping publisher since build result is FAILURE
Recording test results
Email was triggered for: Failure - Any
Sending email for trigger: Failure - Any



###################################################################################
############################## FAILED TESTS (if any) ##############################
6 tests failed.
FAILED:  org.apache.zookeeper.server.quorum.ReconfigRecoveryTest.testCurrentServersAreObserversInNextConfig

Error Message:
waiting for server 1 being up

Stack Trace:
junit.framework.AssertionFailedError: waiting for server 1 being up
	at org.apache.zookeeper.server.quorum.ReconfigRecoveryTest.testCurrentServersAreObserversInNextConfig(ReconfigRecoveryTest.java:217)
	at org.apache.zookeeper.JUnit4ZKTestRunner$LoggedInvokeMethod.evaluate(JUnit4ZKTestRunner.java:79)


FAILED:  org.apache.zookeeper.server.quorum.ReconfigRecoveryTest.testNextConfigCompletion

Error Message:
waiting for server 0 being up

Stack Trace:
junit.framework.AssertionFailedError: waiting for server 0 being up
	at org.apache.zookeeper.server.quorum.ReconfigRecoveryTest.testNextConfigCompletion(ReconfigRecoveryTest.java:81)
	at org.apache.zookeeper.JUnit4ZKTestRunner$LoggedInvokeMethod.evaluate(JUnit4ZKTestRunner.java:79)


FAILED:  org.apache.zookeeper.test.ChrootClientTest.testDeleteWithChildren

Error Message:
Unable to connect to server

Stack Trace:
junit.framework.AssertionFailedError: Unable to connect to server
	at org.apache.zookeeper.test.ClientBase.createClient(ClientBase.java:188)
	at org.apache.zookeeper.test.ClientBase.createClient(ClientBase.java:177)
	at org.apache.zookeeper.test.ClientBase.createClient(ClientBase.java:162)
	at org.apache.zookeeper.test.ChrootClientTest.setUp(ChrootClientTest.java:41)


FAILED:  org.apache.zookeeper.test.AsyncHammerTest.testHammer

Error Message:
unable to create new native thread

Stack Trace:
java.lang.OutOfMemoryError: unable to create new native thread
	at java.lang.Thread.start0(Native Method)
	at java.lang.Thread.start(Thread.java:713)
	at org.apache.zookeeper.server.quorum.QuorumPeer.createElectionAlgorithm(QuorumPeer.java:945)
	at org.apache.zookeeper.server.quorum.QuorumPeer.startLeaderElection(QuorumPeer.java:833)
	at org.apache.zookeeper.server.quorum.QuorumPeer.start(QuorumPeer.java:757)
	at org.apache.zookeeper.test.QuorumBase.startServers(QuorumBase.java:210)
	at org.apache.zookeeper.test.QuorumBase.setUp(QuorumBase.java:120)
	at org.apache.zookeeper.test.AsyncHammerTest.setUp(AsyncHammerTest.java:52)
	at org.apache.zookeeper.test.AsyncHammerTest.testHammer(AsyncHammerTest.java:171)
	at org.apache.zookeeper.JUnit4ZKTestRunner$LoggedInvokeMethod.evaluate(JUnit4ZKTestRunner.java:79)


FAILED:  org.apache.zookeeper.test.AsyncHammerTest.testObserversHammer

Error Message:
unable to create new native thread

Stack Trace:
java.lang.OutOfMemoryError: unable to create new native thread
	at java.lang.Thread.start0(Native Method)
	at java.lang.Thread.start(Thread.java:713)
	at com.sun.jmx.remote.internal.ClientCommunicatorAdmin.<init>(ClientCommunicatorAdmin.java:45)
	at javax.management.remote.rmi.RMIConnector$RMIClientCommunicatorAdmin.<init>(RMIConnector.java:1467)
	at javax.management.remote.rmi.RMIConnector.connect(RMIConnector.java:339)
	at javax.management.remote.JMXConnectorFactory.connect(JMXConnectorFactory.java:270)
	at javax.management.remote.JMXConnectorFactory.connect(JMXConnectorFactory.java:229)
	at org.apache.zookeeper.test.JMXEnv.setUp(JMXEnv.java:58)
	at org.apache.zookeeper.test.QuorumBase.setUp(QuorumBase.java:85)
	at org.apache.zookeeper.test.AsyncHammerTest.setUp(AsyncHammerTest.java:52)
	at org.apache.zookeeper.test.AsyncHammerTest.testObserversHammer(AsyncHammerTest.java:203)
	at org.apache.zookeeper.JUnit4ZKTestRunner$LoggedInvokeMethod.evaluate(JUnit4ZKTestRunner.java:79)


FAILED:  org.apache.zookeeper.test.SSLTest.testSecureQuorumServer

Error Message:
waiting for server 0 being up

Stack Trace:
junit.framework.AssertionFailedError: waiting for server 0 being up
	at org.apache.zookeeper.test.SSLTest.testSecureQuorumServer(SSLTest.java:100)
	at org.apache.zookeeper.JUnit4ZKTestRunner$LoggedInvokeMethod.evaluate(JUnit4ZKTestRunner.java:79)



Mime
  • Unnamed multipart/mixed (inline, None, 0 bytes)
View raw message