zookeeper-dev mailing list archives

Site index · List index
Message view « Date » · « Thread »
Top « Date » · « Thread »
From Apache Jenkins Server <jenk...@builds.apache.org>
Subject ZooKeeper_branch35_jdk8 - Build # 72 - Failure
Date Wed, 04 May 2016 13:08:57 GMT
See https://builds.apache.org/job/ZooKeeper_branch35_jdk8/72/

###################################################################################
########################## LAST 60 LINES OF THE CONSOLE ###########################
[...truncated 390400 lines...]
     [exec] Log Message Received: [2016-05-04 13:06:52,526:10745(0x2adf6f506540):ZOO_INFO@testLogCallbackInit@993:
testLogCallbackInit #8]
     [exec] Log Message Received: [2016-05-04 13:06:52,526:10745(0x2adf6f506540):ZOO_INFO@testLogCallbackInit@993:
testLogCallbackInit #9]
     [exec] Log Message Received: [2016-05-04 13:06:52,526:10745(0x2adf6f506540):ZOO_INFO@zookeeper_close@3257:
Closing zookeeper sessionId=0x1028b3c5489000e to [127.0.0.1:22181]
     [exec] ]
     [exec]  : elapsed 1000 : OK
     [exec] Zookeeper_simpleSystem::testLogCallbackClearLog Message Received: [2016-05-04
13:06:52,526:10745(0x2adf6f506540):ZOO_INFO@log_env@1027: Client environment:zookeeper.version=zookeeper
C client 3.5.1]
     [exec] Log Message Received: [2016-05-04 13:06:52,526:10745(0x2adf6f506540):ZOO_INFO@log_env@1031:
Client environment:host.name=asf910.gq1.ygridcore.net]
     [exec] Log Message Received: [2016-05-04 13:06:52,526:10745(0x2adf6f506540):ZOO_INFO@log_env@1038:
Client environment:os.name=Linux]
     [exec] Log Message Received: [2016-05-04 13:06:52,526:10745(0x2adf6f506540):ZOO_INFO@log_env@1039:
Client environment:os.arch=3.13.0-36-lowlatency]
     [exec] Log Message Received: [2016-05-04 13:06:52,526:10745(0x2adf6f506540):ZOO_INFO@log_env@1040:
Client environment:os.version=#63-Ubuntu SMP PREEMPT Wed Sep 3 21:56:12 UTC 2014]
     [exec] Log Message Received: [2016-05-04 13:06:52,526:10745(0x2adf6f506540):ZOO_INFO@log_env@1048:
Client environment:user.name=jenkins]
     [exec] Log Message Received: [2016-05-04 13:06:52,526:10745(0x2adf6f506540):ZOO_INFO@log_env@1056:
Client environment:user.home=/home/jenkins]
     [exec] Log Message Received: [2016-05-04 13:06:52,526:10745(0x2adf6f506540):ZOO_INFO@log_env@1068:
Client environment:user.dir=/home/jenkins/jenkins-slave/workspace/ZooKeeper_branch35_jdk8/branch-3.5/build/test/test-cppunit]
     [exec] Log Message Received: [2016-05-04 13:06:52,526:10745(0x2adf6f506540):ZOO_INFO@zookeeper_init_internal@1111:
Initiating client connection, host=127.0.0.1:22181 sessionTimeout=10000 watcher=0x45d2a0 sessionId=0
sessionPasswd=<null> context=0x7fff6beab980 flags=0]
     [exec] Log Message Received: [2016-05-04 13:06:52,527:10745(0x2adf71b95700):ZOO_INFO@check_events@2357:
initiated connection to server [127.0.0.1:22181]]
     [exec] Log Message Received: [2016-05-04 13:06:52,540:10745(0x2adf71b95700):ZOO_INFO@check_events@2409:
session establishment complete on server [127.0.0.1:22181], sessionId=0x1028b3c5489000f, negotiated
timeout=10000 ]
     [exec]  : elapsed 1000 : OK
     [exec] Zookeeper_simpleSystem::testAsyncWatcherAutoReset ZooKeeper server started : elapsed
11128 : OK
     [exec] Zookeeper_simpleSystem::testDeserializeString : elapsed 0 : OK
     [exec] Zookeeper_simpleSystem::testFirstServerDown : elapsed 1003 : OK
     [exec] Zookeeper_simpleSystem::testNullData : elapsed 1041 : OK
     [exec] Zookeeper_simpleSystem::testIPV6 : elapsed 1013 : OK
     [exec] Zookeeper_simpleSystem::testCreate : elapsed 1025 : OK
     [exec] Zookeeper_simpleSystem::testPath : elapsed 1064 : OK
     [exec] Zookeeper_simpleSystem::testPathValidation : elapsed 1172 : OK
     [exec] Zookeeper_simpleSystem::testPing : elapsed 18201 : OK
     [exec] Zookeeper_simpleSystem::testAcl : elapsed 1026 : OK
     [exec] Zookeeper_simpleSystem::testChroot : elapsed 4108 : OK
     [exec] Zookeeper_simpleSystem::testAuth ZooKeeper server started ZooKeeper server started
: elapsed 30718 : OK
     [exec] Zookeeper_simpleSystem::testHangingClient : elapsed 1031 : OK
     [exec] Zookeeper_simpleSystem::testWatcherAutoResetWithGlobal ZooKeeper server started
ZooKeeper server started ZooKeeper server started : elapsed 17216 : OK
     [exec] Zookeeper_simpleSystem::testWatcherAutoResetWithLocal ZooKeeper server started
ZooKeeper server started ZooKeeper server started : elapsed 18554 : OK
     [exec] Zookeeper_simpleSystem::testGetChildren2 : elapsed 1101 : OK
     [exec] Zookeeper_simpleSystem::testLastZxid : elapsed 4531 : OK
     [exec] Zookeeper_simpleSystem::testRemoveWatchers ZooKeeper server started : elapsed
5366 : OK
     [exec] Zookeeper_readOnly::testReadOnly : elapsed 4336 : OK
     [exec] /home/jenkins/jenkins-slave/workspace/ZooKeeper_branch35_jdk8/branch-3.5/src/c/tests/TestReconfig.cc:183:
Assertion: equality assertion failed [Expected: 1, Actual  : 0]
     [exec] Failures !!!
     [exec] Run: 72   Failure total: 1   Failures: 1   Errors: 0
     [exec] FAIL: zktest-mt
     [exec] ==========================================
     [exec] 1 of 2 tests failed
     [exec] Please report to user@zookeeper.apache.org
     [exec] ==========================================
     [exec] make[1]: Leaving directory `/home/jenkins/jenkins-slave/workspace/ZooKeeper_branch35_jdk8/branch-3.5/build/test/test-cppunit'
     [exec] make[1]: *** [check-TESTS] Error 1
     [exec] make: *** [check-am] Error 2

BUILD FAILED
/home/jenkins/jenkins-slave/workspace/ZooKeeper_branch35_jdk8/branch-3.5/build.xml:1322: The
following error occurred while executing this line:
/home/jenkins/jenkins-slave/workspace/ZooKeeper_branch35_jdk8/branch-3.5/build.xml:1282: The
following error occurred while executing this line:
/home/jenkins/jenkins-slave/workspace/ZooKeeper_branch35_jdk8/branch-3.5/build.xml:1292: exec
returned: 2

Total time: 17 minutes 12 seconds
Build step 'Invoke Ant' marked build as failure
Archiving artifacts
Recording test results
Email was triggered for: Failure - Any
Sending email for trigger: Failure - Any



###################################################################################
############################## FAILED TESTS (if any) ##############################
All tests passed
Mime
  • Unnamed multipart/mixed (inline, None, 0 bytes)
View raw message