zookeeper-dev mailing list archives

Site index · List index
Message view « Date » · « Thread »
Top « Date » · « Thread »
From Apache Jenkins Server <jenk...@builds.apache.org>
Subject ZooKeeper_branch35_jdk7 - Build # 501 - Failure
Date Mon, 02 May 2016 08:48:18 GMT
See https://builds.apache.org/job/ZooKeeper_branch35_jdk7/501/

###################################################################################
########################## LAST 60 LINES OF THE CONSOLE ###########################
[...truncated 358273 lines...]
    [junit] 	at org.apache.zookeeper.server.quorum.LearnerHandler.run(LearnerHandler.java:622)
    [junit] 2016-05-02 08:46:34,932 [myid:] - INFO  [NIOServerCxnFactory.SelectorThread-0:NIOServerCnxnFactory$SelectorThread@420]
- selector thread exitted run method
    [junit] 2016-05-02 08:46:34,932 [myid:] - WARN  [LearnerHandler-/127.0.0.1:52671:LearnerHandler@619]
- ******* GOODBYE /127.0.0.1:52671 ********
    [junit] 2016-05-02 08:46:34,940 [myid:] - WARN  [LearnerHandler-/127.0.0.1:52671:LearnerHandler@903]
- Ignoring unexpected exception
    [junit] java.lang.InterruptedException
    [junit] 	at java.util.concurrent.locks.AbstractQueuedSynchronizer.acquireInterruptibly(AbstractQueuedSynchronizer.java:1219)
    [junit] 	at java.util.concurrent.locks.ReentrantLock.lockInterruptibly(ReentrantLock.java:340)
    [junit] 	at java.util.concurrent.LinkedBlockingQueue.put(LinkedBlockingQueue.java:338)
    [junit] 	at org.apache.zookeeper.server.quorum.LearnerHandler.shutdown(LearnerHandler.java:901)
    [junit] 	at org.apache.zookeeper.server.quorum.LearnerHandler.run(LearnerHandler.java:622)
    [junit] 2016-05-02 08:46:34,940 [myid:] - INFO  [/127.0.0.1:22137:QuorumCnxManager$Listener@659]
- Leaving listener
    [junit] 2016-05-02 08:46:34,940 [myid:] - INFO  [QuorumPeer[myid=5](plain=/127.0.0.1:22135)(secure=disabled):MBeanRegistry@128]
- Unregister MBean [org.apache.ZooKeeperService:name0=ReplicatedServer_id5,name1=replica.5,name2=Leader]
    [junit] 2016-05-02 08:46:34,941 [myid:] - WARN  [QuorumPeer[myid=5](plain=/127.0.0.1:22135)(secure=disabled):QuorumPeer@1126]
- Unexpected exception
    [junit] java.lang.InterruptedException
    [junit] 	at java.lang.Object.wait(Native Method)
    [junit] 	at org.apache.zookeeper.server.quorum.Leader.lead(Leader.java:559)
    [junit] 	at org.apache.zookeeper.server.quorum.QuorumPeer.run(QuorumPeer.java:1123)
    [junit] 2016-05-02 08:46:34,941 [myid:] - INFO  [QuorumPeer[myid=5](plain=/127.0.0.1:22135)(secure=disabled):Leader@613]
- Shutting down
    [junit] 2016-05-02 08:46:34,941 [myid:] - WARN  [QuorumPeer[myid=5](plain=/127.0.0.1:22135)(secure=disabled):QuorumPeer@1157]
- PeerState set to LOOKING
    [junit] 2016-05-02 08:46:34,941 [myid:] - WARN  [QuorumPeer[myid=5](plain=/127.0.0.1:22135)(secure=disabled):QuorumPeer@1139]
- QuorumPeer main thread exited
    [junit] 2016-05-02 08:46:34,942 [myid:] - INFO  [QuorumPeer[myid=5](plain=/127.0.0.1:22135)(secure=disabled):MBeanRegistry@128]
- Unregister MBean [org.apache.ZooKeeperService:name0=ReplicatedServer_id5]
    [junit] 2016-05-02 08:46:34,942 [myid:] - INFO  [QuorumPeer[myid=5](plain=/127.0.0.1:22135)(secure=disabled):MBeanRegistry@128]
- Unregister MBean [org.apache.ZooKeeperService:name0=ReplicatedServer_id5,name1=replica.5]
    [junit] 2016-05-02 08:46:34,942 [myid:] - INFO  [QuorumPeer[myid=5](plain=/127.0.0.1:22135)(secure=disabled):MBeanRegistry@128]
- Unregister MBean [org.apache.ZooKeeperService:name0=ReplicatedServer_id5,name1=replica.1]
    [junit] 2016-05-02 08:46:34,943 [myid:] - INFO  [QuorumPeer[myid=5](plain=/127.0.0.1:22135)(secure=disabled):MBeanRegistry@128]
- Unregister MBean [org.apache.ZooKeeperService:name0=ReplicatedServer_id5,name1=replica.2]
    [junit] 2016-05-02 08:46:34,943 [myid:] - INFO  [QuorumPeer[myid=5](plain=/127.0.0.1:22135)(secure=disabled):MBeanRegistry@128]
- Unregister MBean [org.apache.ZooKeeperService:name0=ReplicatedServer_id5,name1=replica.3]
    [junit] 2016-05-02 08:46:34,944 [myid:] - INFO  [main:QuorumUtil@254] - Shutting down
leader election QuorumPeer[myid=5](plain=/127.0.0.1:22135)(secure=disabled)
    [junit] 2016-05-02 08:46:34,945 [myid:] - INFO  [main:QuorumUtil@259] - Waiting for QuorumPeer[myid=5](plain=/127.0.0.1:22135)(secure=disabled)
to exit thread
    [junit] 2016-05-02 08:46:34,945 [myid:] - INFO  [main:FourLetterWordMain@85] - connecting
to 127.0.0.1 22123
    [junit] 2016-05-02 08:46:34,946 [myid:] - INFO  [main:QuorumUtil@243] - 127.0.0.1:22123
is no longer accepting client connections
    [junit] 2016-05-02 08:46:34,946 [myid:] - INFO  [main:FourLetterWordMain@85] - connecting
to 127.0.0.1 22126
    [junit] 2016-05-02 08:46:34,947 [myid:] - INFO  [main:QuorumUtil@243] - 127.0.0.1:22126
is no longer accepting client connections
    [junit] 2016-05-02 08:46:34,947 [myid:] - INFO  [main:FourLetterWordMain@85] - connecting
to 127.0.0.1 22129
    [junit] 2016-05-02 08:46:34,947 [myid:] - INFO  [main:QuorumUtil@243] - 127.0.0.1:22129
is no longer accepting client connections
    [junit] 2016-05-02 08:46:34,948 [myid:] - INFO  [main:FourLetterWordMain@85] - connecting
to 127.0.0.1 22132
    [junit] 2016-05-02 08:46:34,948 [myid:] - INFO  [main:QuorumUtil@243] - 127.0.0.1:22132
is no longer accepting client connections
    [junit] 2016-05-02 08:46:34,948 [myid:] - INFO  [main:FourLetterWordMain@85] - connecting
to 127.0.0.1 22135
    [junit] 2016-05-02 08:46:34,949 [myid:] - INFO  [main:QuorumUtil@243] - 127.0.0.1:22135
is no longer accepting client connections
    [junit] 2016-05-02 08:46:34,952 [myid:] - INFO  [main:ZKTestCase$1@65] - SUCCEEDED testRemoveOneAsynchronous
    [junit] 2016-05-02 08:46:34,953 [myid:] - INFO  [main:ZKTestCase$1@60] - FINISHED testRemoveOneAsynchronous
    [junit] Tests run: 11, Failures: 0, Errors: 0, Skipped: 0, Time elapsed: 120.666 sec,
Thread: 5, Class: org.apache.zookeeper.test.ReconfigTest
    [junit] 2016-05-02 08:46:34,965 [myid:127.0.0.1:22032] - INFO  [main-SendThread(127.0.0.1:22032):ClientCnxn$SendThread@1140]
- Opening socket connection to server 127.0.0.1/127.0.0.1:22032. Will not attempt to authenticate
using SASL (unknown error)
    [junit] 2016-05-02 08:46:34,966 [myid:127.0.0.1:22032] - WARN  [main-SendThread(127.0.0.1:22032):ClientCnxn$SendThread@1262]
- Session 0x10128d00efd0000 for server 127.0.0.1/127.0.0.1:22032, unexpected error, closing
socket connection and attempting reconnect
    [junit] java.net.ConnectException: Connection refused
    [junit] 	at sun.nio.ch.SocketChannelImpl.checkConnect(Native Method)
    [junit] 	at sun.nio.ch.SocketChannelImpl.finishConnect(SocketChannelImpl.java:744)
    [junit] 	at org.apache.zookeeper.ClientCnxnSocketNIO.doTransport(ClientCnxnSocketNIO.java:355)
    [junit] 	at org.apache.zookeeper.ClientCnxn$SendThread.run(ClientCnxn.java:1241)
    [junit] 2016-05-02 08:46:35,386 [myid:127.0.0.1:22035] - INFO  [main-SendThread(127.0.0.1:22035):ClientCnxn$SendThread@1140]
- Opening socket connection to server 127.0.0.1/127.0.0.1:22035. Will not attempt to authenticate
using SASL (unknown error)

BUILD FAILED
/home/jenkins/jenkins-slave/workspace/ZooKeeper_branch35_jdk7/branch-3.5/build.xml:1322: The
following error occurred while executing this line:
/home/jenkins/jenkins-slave/workspace/ZooKeeper_branch35_jdk7/branch-3.5/build.xml:1207: Tests
failed!

Total time: 7 minutes 2 seconds
Build step 'Invoke Ant' marked build as failure
Archiving artifacts
Recording test results
Email was triggered for: Failure - Any
Sending email for trigger: Failure - Any



###################################################################################
############################## FAILED TESTS (if any) ##############################
1 tests failed.
FAILED:  org.apache.zookeeper.test.LETest.testLE

Error Message:
Threads didn't join

Stack Trace:
junit.framework.AssertionFailedError: Threads didn't join
	at org.apache.zookeeper.test.LETest.testLE(LETest.java:123)
	at org.apache.zookeeper.JUnit4ZKTestRunner$LoggedInvokeMethod.evaluate(JUnit4ZKTestRunner.java:79)



Mime
  • Unnamed multipart/mixed (inline, None, 0 bytes)
View raw message