zookeeper-dev mailing list archives

Site index · List index
Message view « Date » · « Thread »
Top « Date » · « Thread »
From Apache Jenkins Server <jenk...@builds.apache.org>
Subject ZooKeeper-trunk - Build # 2907 - Still Failing
Date Sun, 01 May 2016 23:29:46 GMT
See https://builds.apache.org/job/ZooKeeper-trunk/2907/

###################################################################################
########################## LAST 60 LINES OF THE CONSOLE ###########################
[...truncated 383737 lines...]
    [junit] 	at sun.nio.ch.SocketChannelImpl.finishConnect(SocketChannelImpl.java:744)
    [junit] 	at org.apache.zookeeper.ClientCnxnSocketNIO.doTransport(ClientCnxnSocketNIO.java:355)
    [junit] 	at org.apache.zookeeper.ClientCnxn$SendThread.run(ClientCnxn.java:1241)
    [junit] Test org.apache.zookeeper.test.ReconfigTest FAILED
    [junit] 2016-05-01 23:29:31,688 [myid:] - INFO  [main:JUnit4ZKTestRunner$LoggedInvokeMethod@82]
- Memory used 26997
    [junit] 2016-05-01 23:29:31,688 [myid:] - INFO  [main:JUnit4ZKTestRunner$LoggedInvokeMethod@87]
- Number of threads 55
    [junit] 2016-05-01 23:29:31,688 [myid:] - INFO  [main:JUnit4ZKTestRunner$LoggedInvokeMethod@102]
- FINISHED TEST METHOD testManyChildWatchersAutoReset
    [junit] 2016-05-01 23:29:31,688 [myid:] - INFO  [main:ClientBase@537] - tearDown starting
    [junit] 2016-05-01 23:29:31,689 [myid:] - INFO  [ProcessThread(sid:0 cport:21997)::PrepRequestProcessor@647]
- Processed session termination for sessionid: 0x1027810995e0000
    [junit] 2016-05-01 23:29:31,697 [myid:] - INFO  [main:ZooKeeper@1110] - Session: 0x1027810995e0000
closed
    [junit] 2016-05-01 23:29:31,697 [myid:] - INFO  [NIOWorkerThread-24:MBeanRegistry@128]
- Unregister MBean [org.apache.ZooKeeperService:name0=StandaloneServer_port21997,name1=Connections,name2=127.0.0.1,name3=0x1027810995e0000]
    [junit] 2016-05-01 23:29:31,698 [myid:] - INFO  [NIOWorkerThread-24:NIOServerCnxn@607]
- Closed socket connection for client /127.0.0.1:57386 which had sessionid 0x1027810995e0000
    [junit] 2016-05-01 23:29:31,698 [myid:] - INFO  [main-EventThread:ClientCnxn$EventThread@543]
- EventThread shut down for session: 0x1027810995e0000
    [junit] 2016-05-01 23:29:31,698 [myid:] - INFO  [ProcessThread(sid:0 cport:21997)::PrepRequestProcessor@647]
- Processed session termination for sessionid: 0x1027810995e0001
    [junit] 2016-05-01 23:29:31,710 [myid:] - INFO  [NIOWorkerThread-3:MBeanRegistry@128]
- Unregister MBean [org.apache.ZooKeeperService:name0=StandaloneServer_port21997,name1=Connections,name2=127.0.0.1,name3=0x1027810995e0001]
    [junit] 2016-05-01 23:29:31,710 [myid:] - INFO  [NIOWorkerThread-3:NIOServerCnxn@607]
- Closed socket connection for client /127.0.0.1:57394 which had sessionid 0x1027810995e0001
    [junit] 2016-05-01 23:29:31,711 [myid:] - INFO  [main:ZooKeeper@1110] - Session: 0x1027810995e0001
closed
    [junit] 2016-05-01 23:29:31,711 [myid:] - INFO  [main:ClientBase@507] - STOPPING server
    [junit] 2016-05-01 23:29:31,711 [myid:] - INFO  [main-EventThread:ClientCnxn$EventThread@543]
- EventThread shut down for session: 0x1027810995e0001
    [junit] 2016-05-01 23:29:31,713 [myid:] - INFO  [ConnnectionExpirer:NIOServerCnxnFactory$ConnectionExpirerThread@583]
- ConnnectionExpirerThread interrupted
    [junit] 2016-05-01 23:29:31,713 [myid:] - INFO  [NIOServerCxnFactory.SelectorThread-0:NIOServerCnxnFactory$SelectorThread@420]
- selector thread exitted run method
    [junit] 2016-05-01 23:29:31,714 [myid:] - INFO  [NIOServerCxnFactory.SelectorThread-1:NIOServerCnxnFactory$SelectorThread@420]
- selector thread exitted run method
    [junit] 2016-05-01 23:29:31,724 [myid:] - INFO  [NIOServerCxnFactory.AcceptThread:0.0.0.0/0.0.0.0:21997:NIOServerCnxnFactory$AcceptThread@219]
- accept thread exitted run method
    [junit] 2016-05-01 23:29:31,727 [myid:] - INFO  [main:ZooKeeperServer@498] - shutting
down
    [junit] 2016-05-01 23:29:31,727 [myid:] - INFO  [main:SessionTrackerImpl@232] - Shutting
down
    [junit] 2016-05-01 23:29:31,727 [myid:] - INFO  [main:PrepRequestProcessor@965] - Shutting
down
    [junit] 2016-05-01 23:29:31,727 [myid:] - INFO  [main:SyncRequestProcessor@191] - Shutting
down
    [junit] 2016-05-01 23:29:31,727 [myid:] - INFO  [ProcessThread(sid:0 cport:21997)::PrepRequestProcessor@154]
- PrepRequestProcessor exited loop!
    [junit] 2016-05-01 23:29:31,730 [myid:] - INFO  [SyncThread:0:SyncRequestProcessor@169]
- SyncRequestProcessor exited!
    [junit] 2016-05-01 23:29:31,730 [myid:] - INFO  [main:FinalRequestProcessor@479] - shutdown
of request processor complete
    [junit] 2016-05-01 23:29:31,730 [myid:] - INFO  [main:MBeanRegistry@128] - Unregister
MBean [org.apache.ZooKeeperService:name0=StandaloneServer_port21997,name1=InMemoryDataTree]
    [junit] 2016-05-01 23:29:31,731 [myid:] - INFO  [main:MBeanRegistry@128] - Unregister
MBean [org.apache.ZooKeeperService:name0=StandaloneServer_port21997]
    [junit] 2016-05-01 23:29:31,733 [myid:] - INFO  [main:FourLetterWordMain@85] - connecting
to 127.0.0.1 21997
    [junit] 2016-05-01 23:29:31,733 [myid:] - INFO  [main:JMXEnv@146] - ensureOnly:[]
    [junit] 2016-05-01 23:29:31,748 [myid:] - INFO  [main:ClientBase@562] - fdcount after
test is: 51 at start it was 51
    [junit] 2016-05-01 23:29:31,748 [myid:] - INFO  [main:ZKTestCase$1@65] - SUCCEEDED testManyChildWatchersAutoReset
    [junit] 2016-05-01 23:29:31,748 [myid:] - INFO  [main:ZKTestCase$1@60] - FINISHED testManyChildWatchersAutoReset
    [junit] Tests run: 4, Failures: 0, Errors: 0, Skipped: 0, Time elapsed: 410.885 sec, Thread:
5, Class: org.apache.zookeeper.test.DisconnectedWatcherTest

BUILD FAILED
/home/jenkins/jenkins-slave/workspace/ZooKeeper-trunk/trunk/build.xml:1322: The following
error occurred while executing this line:
/home/jenkins/jenkins-slave/workspace/ZooKeeper-trunk/trunk/build.xml:1207: Tests failed!

Total time: 10 minutes 38 seconds
Build step 'Execute shell' marked build as failure
[FINDBUGS] Skipping publisher since build result is FAILURE
[WARNINGS] Skipping publisher since build result is FAILURE
Archiving artifacts
Setting LATEST1_7_HOME=/home/jenkins/jenkins-slave/tools/hudson.model.JDK/latest1.7
Recording fingerprints
Setting LATEST1_7_HOME=/home/jenkins/jenkins-slave/tools/hudson.model.JDK/latest1.7
Recording test results
Setting LATEST1_7_HOME=/home/jenkins/jenkins-slave/tools/hudson.model.JDK/latest1.7
Publishing Javadoc
Setting LATEST1_7_HOME=/home/jenkins/jenkins-slave/tools/hudson.model.JDK/latest1.7
Email was triggered for: Failure - Any
Sending email for trigger: Failure - Any
Setting LATEST1_7_HOME=/home/jenkins/jenkins-slave/tools/hudson.model.JDK/latest1.7
Setting LATEST1_7_HOME=/home/jenkins/jenkins-slave/tools/hudson.model.JDK/latest1.7



###################################################################################
############################## FAILED TESTS (if any) ##############################
1 tests failed.
FAILED:  org.apache.zookeeper.test.ReconfigTest.testPortChange

Error Message:
expected:<test[1]> but was:<test[0]>

Stack Trace:
junit.framework.AssertionFailedError: expected:<test[1]> but was:<test[0]>
	at org.apache.zookeeper.test.ReconfigTest.testNormalOperation(ReconfigTest.java:150)
	at org.apache.zookeeper.test.ReconfigTest.testPortChange(ReconfigTest.java:598)
	at org.apache.zookeeper.JUnit4ZKTestRunner$LoggedInvokeMethod.evaluate(JUnit4ZKTestRunner.java:79)



Mime
  • Unnamed multipart/mixed (inline, None, 0 bytes)
View raw message