zookeeper-dev mailing list archives

Site index · List index
Message view « Date » · « Thread »
Top « Date » · « Thread »
From Apache Jenkins Server <jenk...@builds.apache.org>
Subject ZooKeeper-trunk-solaris - Build # 1142 - Failure
Date Mon, 02 May 2016 08:34:27 GMT
See https://builds.apache.org/job/ZooKeeper-trunk-solaris/1142/

###################################################################################
########################## LAST 60 LINES OF THE CONSOLE ###########################
[...truncated 323494 lines...]
    [junit] 2016-05-02 08:30:17,068 [myid:] - INFO  [main:JMXEnv@146] - ensureOnly:[]
    [junit] 2016-05-02 08:30:17,068 [myid:] - INFO  [main:ClientBase@460] - STARTING server
    [junit] 2016-05-02 08:30:17,069 [myid:] - INFO  [main:ClientBase@380] - CREATING server
instance 127.0.0.1:11222
    [junit] 2016-05-02 08:30:17,069 [myid:] - INFO  [main:NIOServerCnxnFactory@673] - Configuring
NIO connection handler with 10s sessionless connection timeout, 2 selector thread(s), 16 worker
threads, and 64 kB direct buffers.
    [junit] 2016-05-02 08:30:17,069 [myid:] - INFO  [main:NIOServerCnxnFactory@686] - binding
to port 0.0.0.0/0.0.0.0:11222
    [junit] 2016-05-02 08:30:17,070 [myid:] - INFO  [main:ClientBase@355] - STARTING server
instance 127.0.0.1:11222
    [junit] 2016-05-02 08:30:17,070 [myid:] - INFO  [main:ZooKeeperServer@858] - minSessionTimeout
set to 6000
    [junit] 2016-05-02 08:30:17,070 [myid:] - INFO  [main:ZooKeeperServer@867] - maxSessionTimeout
set to 60000
    [junit] 2016-05-02 08:30:17,070 [myid:] - INFO  [main:ZooKeeperServer@156] - Created server
with tickTime 3000 minSessionTimeout 6000 maxSessionTimeout 60000 datadir /zonestorage/hudson_solaris/home/hudson/hudson-slave/workspace/ZooKeeper-trunk-solaris/trunk/build/test/tmp/test5439974464884206665.junit.dir/version-2
snapdir /zonestorage/hudson_solaris/home/hudson/hudson-slave/workspace/ZooKeeper-trunk-solaris/trunk/build/test/tmp/test5439974464884206665.junit.dir/version-2
    [junit] 2016-05-02 08:30:17,071 [myid:] - INFO  [main:FileSnap@83] - Reading snapshot
/zonestorage/hudson_solaris/home/hudson/hudson-slave/workspace/ZooKeeper-trunk-solaris/trunk/build/test/tmp/test5439974464884206665.junit.dir/version-2/snapshot.b
    [junit] 2016-05-02 08:30:17,074 [myid:] - INFO  [main:FileTxnSnapLog@298] - Snapshotting:
0xb to /zonestorage/hudson_solaris/home/hudson/hudson-slave/workspace/ZooKeeper-trunk-solaris/trunk/build/test/tmp/test5439974464884206665.junit.dir/version-2/snapshot.b
    [junit] 2016-05-02 08:30:17,075 [myid:] - INFO  [main:FourLetterWordMain@85] - connecting
to 127.0.0.1 11222
    [junit] 2016-05-02 08:30:17,076 [myid:] - INFO  [NIOServerCxnFactory.AcceptThread:0.0.0.0/0.0.0.0:11222:NIOServerCnxnFactory$AcceptThread@296]
- Accepted socket connection from /127.0.0.1:51480
    [junit] 2016-05-02 08:30:17,077 [myid:] - INFO  [NIOWorkerThread-1:NIOServerCnxn@485]
- Processing stat command from /127.0.0.1:51480
    [junit] 2016-05-02 08:30:17,078 [myid:] - INFO  [NIOWorkerThread-1:StatCommand@49] - Stat
command output
    [junit] 2016-05-02 08:30:17,078 [myid:] - INFO  [NIOWorkerThread-1:NIOServerCnxn@607]
- Closed socket connection for client /127.0.0.1:51480 (no session established for client)
    [junit] 2016-05-02 08:30:17,078 [myid:] - INFO  [main:JMXEnv@228] - ensureParent:[InMemoryDataTree,
StandaloneServer_port]
    [junit] 2016-05-02 08:30:17,080 [myid:] - INFO  [main:JMXEnv@245] - expect:InMemoryDataTree
    [junit] 2016-05-02 08:30:17,081 [myid:] - INFO  [main:JMXEnv@249] - found:InMemoryDataTree
org.apache.ZooKeeperService:name0=StandaloneServer_port11222,name1=InMemoryDataTree
    [junit] 2016-05-02 08:30:17,081 [myid:] - INFO  [main:JMXEnv@245] - expect:StandaloneServer_port
    [junit] 2016-05-02 08:30:17,081 [myid:] - INFO  [main:JMXEnv@249] - found:StandaloneServer_port
org.apache.ZooKeeperService:name0=StandaloneServer_port11222
    [junit] 2016-05-02 08:30:17,081 [myid:] - INFO  [main:JUnit4ZKTestRunner$LoggedInvokeMethod@82]
- Memory used 17683
    [junit] 2016-05-02 08:30:17,081 [myid:] - INFO  [main:JUnit4ZKTestRunner$LoggedInvokeMethod@87]
- Number of threads 24
    [junit] 2016-05-02 08:30:17,082 [myid:] - INFO  [main:JUnit4ZKTestRunner$LoggedInvokeMethod@102]
- FINISHED TEST METHOD testQuota
    [junit] 2016-05-02 08:30:17,082 [myid:] - INFO  [main:ClientBase@537] - tearDown starting
    [junit] 2016-05-02 08:30:17,152 [myid:] - INFO  [main:ZooKeeper@1110] - Session: 0x120ed9466810000
closed
    [junit] 2016-05-02 08:30:17,152 [myid:] - INFO  [main-EventThread:ClientCnxn$EventThread@543]
- EventThread shut down for session: 0x120ed9466810000
    [junit] 2016-05-02 08:30:17,152 [myid:] - INFO  [main:ClientBase@507] - STOPPING server
    [junit] 2016-05-02 08:30:17,153 [myid:] - INFO  [ConnnectionExpirer:NIOServerCnxnFactory$ConnectionExpirerThread@583]
- ConnnectionExpirerThread interrupted
    [junit] 2016-05-02 08:30:17,153 [myid:] - INFO  [NIOServerCxnFactory.SelectorThread-0:NIOServerCnxnFactory$SelectorThread@420]
- selector thread exitted run method
    [junit] 2016-05-02 08:30:17,153 [myid:] - INFO  [NIOServerCxnFactory.AcceptThread:0.0.0.0/0.0.0.0:11222:NIOServerCnxnFactory$AcceptThread@219]
- accept thread exitted run method
    [junit] 2016-05-02 08:30:17,153 [myid:] - INFO  [NIOServerCxnFactory.SelectorThread-1:NIOServerCnxnFactory$SelectorThread@420]
- selector thread exitted run method
    [junit] 2016-05-02 08:30:17,154 [myid:] - INFO  [main:ZooKeeperServer@498] - shutting
down
    [junit] 2016-05-02 08:30:17,154 [myid:] - INFO  [main:SessionTrackerImpl@232] - Shutting
down
    [junit] 2016-05-02 08:30:17,154 [myid:] - INFO  [main:PrepRequestProcessor@965] - Shutting
down
    [junit] 2016-05-02 08:30:17,155 [myid:] - INFO  [main:SyncRequestProcessor@191] - Shutting
down
    [junit] 2016-05-02 08:30:17,155 [myid:] - INFO  [ProcessThread(sid:0 cport:11222)::PrepRequestProcessor@154]
- PrepRequestProcessor exited loop!
    [junit] 2016-05-02 08:30:17,155 [myid:] - INFO  [SyncThread:0:SyncRequestProcessor@169]
- SyncRequestProcessor exited!
    [junit] 2016-05-02 08:30:17,155 [myid:] - INFO  [main:FinalRequestProcessor@479] - shutdown
of request processor complete
    [junit] 2016-05-02 08:30:17,156 [myid:] - INFO  [main:MBeanRegistry@128] - Unregister
MBean [org.apache.ZooKeeperService:name0=StandaloneServer_port11222,name1=InMemoryDataTree]
    [junit] 2016-05-02 08:30:17,156 [myid:] - INFO  [main:MBeanRegistry@128] - Unregister
MBean [org.apache.ZooKeeperService:name0=StandaloneServer_port11222]
    [junit] 2016-05-02 08:30:17,156 [myid:] - INFO  [main:FourLetterWordMain@85] - connecting
to 127.0.0.1 11222
    [junit] 2016-05-02 08:30:17,157 [myid:] - INFO  [main:JMXEnv@146] - ensureOnly:[]
    [junit] 2016-05-02 08:30:17,161 [myid:] - INFO  [main:ClientBase@562] - fdcount after
test is: 56 at start it was 39
    [junit] 2016-05-02 08:30:17,162 [myid:] - INFO  [main:ClientBase@564] - sleeping for 20
secs
    [junit] 2016-05-02 08:30:17,163 [myid:] - INFO  [main:ZKTestCase$1@65] - SUCCEEDED testQuota
    [junit] 2016-05-02 08:30:17,163 [myid:] - INFO  [main:ZKTestCase$1@60] - FINISHED testQuota
    [junit] Tests run: 1, Failures: 0, Errors: 0, Time elapsed: 2.199 sec

BUILD FAILED
/zonestorage/hudson_solaris/home/hudson/hudson-slave/workspace/ZooKeeper-trunk-solaris/trunk/build.xml:1233:
Tests failed!

Total time: 55 minutes 35 seconds
Build step 'Invoke Ant' marked build as failure
[locks-and-latches] Releasing all the locks
[locks-and-latches] All the locks released
Recording test results
Email was triggered for: Failure - Any
Sending email for trigger: Failure - Any



###################################################################################
############################## FAILED TESTS (if any) ##############################
2 tests failed.
FAILED:  org.apache.zookeeper.test.LETest.testLE

Error Message:
Threads didn't join

Stack Trace:
junit.framework.AssertionFailedError: Threads didn't join
	at org.apache.zookeeper.test.LETest.testLE(LETest.java:123)
	at org.apache.zookeeper.JUnit4ZKTestRunner$LoggedInvokeMethod.evaluate(JUnit4ZKTestRunner.java:79)


FAILED:  org.apache.zookeeper.test.QuorumZxidSyncTest.testBehindLeader

Error Message:
KeeperErrorCode = ConnectionLoss for /0

Stack Trace:
org.apache.zookeeper.KeeperException$ConnectionLossException: KeeperErrorCode = ConnectionLoss
for /0
	at org.apache.zookeeper.KeeperException.create(KeeperException.java:99)
	at org.apache.zookeeper.KeeperException.create(KeeperException.java:51)
	at org.apache.zookeeper.ZooKeeper.create(ZooKeeper.java:1209)
	at org.apache.zookeeper.test.QuorumZxidSyncTest.testBehindLeader(QuorumZxidSyncTest.java:53)
	at org.apache.zookeeper.JUnit4ZKTestRunner$LoggedInvokeMethod.evaluate(JUnit4ZKTestRunner.java:79)



Mime
  • Unnamed multipart/mixed (inline, None, 0 bytes)
View raw message