zookeeper-dev mailing list archives

Site index · List index
Message view « Date » · « Thread »
Top « Date » · « Thread »
From Apache Jenkins Server <jenk...@builds.apache.org>
Subject ZooKeeper_branch34 - Build # 1507 - Failure
Date Tue, 03 May 2016 04:03:34 GMT
See https://builds.apache.org/job/ZooKeeper_branch34/1507/

###################################################################################
########################## LAST 60 LINES OF THE CONSOLE ###########################
[...truncated 222060 lines...]
    [junit] 2016-05-03 04:03:26,923 [myid:] - INFO  [main:ZooKeeperServer@469] - shutting
down
    [junit] 2016-05-03 04:03:26,923 [myid:] - INFO  [main:SessionTrackerImpl@225] - Shutting
down
    [junit] 2016-05-03 04:03:26,923 [myid:] - INFO  [main:PrepRequestProcessor@765] - Shutting
down
    [junit] 2016-05-03 04:03:26,923 [myid:] - INFO  [main:SyncRequestProcessor@209] - Shutting
down
    [junit] 2016-05-03 04:03:26,923 [myid:] - INFO  [SyncThread:0:SyncRequestProcessor@187]
- SyncRequestProcessor exited!
    [junit] 2016-05-03 04:03:26,923 [myid:] - INFO  [main:FinalRequestProcessor@402] - shutdown
of request processor complete
    [junit] 2016-05-03 04:03:26,924 [myid:] - INFO  [main:FourLetterWordMain@62] - connecting
to 127.0.0.1 11221
    [junit] 2016-05-03 04:03:26,924 [myid:] - INFO  [ProcessThread(sid:0 cport:11221)::PrepRequestProcessor@143]
- PrepRequestProcessor exited loop!
    [junit] 2016-05-03 04:03:26,925 [myid:] - INFO  [main:JMXEnv@146] - ensureOnly:[]
    [junit] 2016-05-03 04:03:26,926 [myid:] - INFO  [main:ClientBase@443] - STARTING server
    [junit] 2016-05-03 04:03:26,927 [myid:] - INFO  [main:ClientBase@364] - CREATING server
instance 127.0.0.1:11221
    [junit] 2016-05-03 04:03:26,927 [myid:] - INFO  [main:NIOServerCnxnFactory@89] - binding
to port 0.0.0.0/0.0.0.0:11221
    [junit] 2016-05-03 04:03:26,927 [myid:] - INFO  [main:ClientBase@339] - STARTING server
instance 127.0.0.1:11221
    [junit] 2016-05-03 04:03:26,928 [myid:] - INFO  [main:ZooKeeperServer@170] - Created server
with tickTime 3000 minSessionTimeout 6000 maxSessionTimeout 60000 datadir /home/jenkins/jenkins-slave/workspace/ZooKeeper_branch34/branch-3.4/build/test/tmp/test5510224901973782975.junit.dir/version-2
snapdir /home/jenkins/jenkins-slave/workspace/ZooKeeper_branch34/branch-3.4/build/test/tmp/test5510224901973782975.junit.dir/version-2
    [junit] 2016-05-03 04:03:26,933 [myid:] - INFO  [main:FourLetterWordMain@62] - connecting
to 127.0.0.1 11221
    [junit] 2016-05-03 04:03:26,934 [myid:] - INFO  [NIOServerCxn.Factory:0.0.0.0/0.0.0.0:11221:NIOServerCnxnFactory@192]
- Accepted socket connection from /127.0.0.1:36052
    [junit] 2016-05-03 04:03:26,934 [myid:] - INFO  [NIOServerCxn.Factory:0.0.0.0/0.0.0.0:11221:NIOServerCnxn@827]
- Processing stat command from /127.0.0.1:36052
    [junit] 2016-05-03 04:03:26,937 [myid:] - INFO  [Thread-5:NIOServerCnxn$StatCommand@663]
- Stat command output
    [junit] 2016-05-03 04:03:26,937 [myid:] - INFO  [Thread-5:NIOServerCnxn@1008] - Closed
socket connection for client /127.0.0.1:36052 (no session established for client)
    [junit] 2016-05-03 04:03:26,938 [myid:] - INFO  [main:JMXEnv@229] - ensureParent:[InMemoryDataTree,
StandaloneServer_port]
    [junit] 2016-05-03 04:03:26,940 [myid:] - INFO  [main:JMXEnv@246] - expect:InMemoryDataTree
    [junit] 2016-05-03 04:03:26,940 [myid:] - INFO  [main:JMXEnv@250] - found:InMemoryDataTree
org.apache.ZooKeeperService:name0=StandaloneServer_port11221,name1=InMemoryDataTree
    [junit] 2016-05-03 04:03:26,940 [myid:] - INFO  [main:JMXEnv@246] - expect:StandaloneServer_port
    [junit] 2016-05-03 04:03:26,941 [myid:] - INFO  [main:JMXEnv@250] - found:StandaloneServer_port
org.apache.ZooKeeperService:name0=StandaloneServer_port11221
    [junit] 2016-05-03 04:03:26,941 [myid:] - INFO  [main:JUnit4ZKTestRunner$LoggedInvokeMethod@58]
- Memory used 31174
    [junit] 2016-05-03 04:03:26,942 [myid:] - INFO  [main:JUnit4ZKTestRunner$LoggedInvokeMethod@63]
- Number of threads 20
    [junit] 2016-05-03 04:03:26,942 [myid:] - INFO  [main:JUnit4ZKTestRunner$LoggedInvokeMethod@78]
- FINISHED TEST METHOD testQuota
    [junit] 2016-05-03 04:03:26,942 [myid:] - INFO  [main:ClientBase@520] - tearDown starting
    [junit] 2016-05-03 04:03:26,989 [myid:] - INFO  [main:ZooKeeper@684] - Session: 0x15474c8f04b0000
closed
    [junit] 2016-05-03 04:03:26,989 [myid:] - INFO  [main:ClientBase@490] - STOPPING server
    [junit] 2016-05-03 04:03:26,989 [myid:] - INFO  [main-EventThread:ClientCnxn$EventThread@519]
- EventThread shut down for session: 0x15474c8f04b0000
    [junit] 2016-05-03 04:03:26,990 [myid:] - INFO  [NIOServerCxn.Factory:0.0.0.0/0.0.0.0:11221:NIOServerCnxnFactory@219]
- NIOServerCnxn factory exited run method
    [junit] 2016-05-03 04:03:26,990 [myid:] - INFO  [main:ZooKeeperServer@469] - shutting
down
    [junit] 2016-05-03 04:03:26,990 [myid:] - INFO  [main:SessionTrackerImpl@225] - Shutting
down
    [junit] 2016-05-03 04:03:26,990 [myid:] - INFO  [main:PrepRequestProcessor@765] - Shutting
down
    [junit] 2016-05-03 04:03:26,991 [myid:] - INFO  [main:SyncRequestProcessor@209] - Shutting
down
    [junit] 2016-05-03 04:03:26,991 [myid:] - INFO  [ProcessThread(sid:0 cport:11221)::PrepRequestProcessor@143]
- PrepRequestProcessor exited loop!
    [junit] 2016-05-03 04:03:26,991 [myid:] - INFO  [SyncThread:0:SyncRequestProcessor@187]
- SyncRequestProcessor exited!
    [junit] 2016-05-03 04:03:26,992 [myid:] - INFO  [main:FinalRequestProcessor@402] - shutdown
of request processor complete
    [junit] 2016-05-03 04:03:26,993 [myid:] - INFO  [main:FourLetterWordMain@62] - connecting
to 127.0.0.1 11221
    [junit] 2016-05-03 04:03:26,993 [myid:] - INFO  [main:JMXEnv@146] - ensureOnly:[]
    [junit] 2016-05-03 04:03:26,998 [myid:] - INFO  [main:ClientBase@545] - fdcount after
test is: 38 at start it was 25
    [junit] 2016-05-03 04:03:26,998 [myid:] - INFO  [main:ClientBase@547] - sleeping for 20
secs
    [junit] 2016-05-03 04:03:26,999 [myid:] - INFO  [main:ZKTestCase$1@60] - SUCCEEDED testQuota
    [junit] 2016-05-03 04:03:26,999 [myid:] - INFO  [main:ZKTestCase$1@55] - FINISHED testQuota
    [junit] 2016-05-03 04:03:27,001 [myid:] - INFO  [SessionTracker:SessionTrackerImpl@162]
- SessionTrackerImpl exited loop!
    [junit] 2016-05-03 04:03:27,001 [myid:] - INFO  [SessionTracker:SessionTrackerImpl@162]
- SessionTrackerImpl exited loop!
    [junit] 2016-05-03 04:03:27,001 [myid:] - INFO  [SessionTracker:SessionTrackerImpl@162]
- SessionTrackerImpl exited loop!
    [junit] Tests run: 1, Failures: 0, Errors: 0, Skipped: 0, Time elapsed: 0.944 sec

BUILD FAILED
/home/jenkins/jenkins-slave/workspace/ZooKeeper_branch34/branch-3.4/build.xml:1409: The following
error occurred while executing this line:
/home/jenkins/jenkins-slave/workspace/ZooKeeper_branch34/branch-3.4/build.xml:1320: Tests
failed!

Total time: 37 minutes 37 seconds
Build step 'Execute shell' marked build as failure
Recording test results
Email was triggered for: Failure - Any
Sending email for trigger: Failure - Any



###################################################################################
############################## FAILED TESTS (if any) ##############################
1 tests failed.
FAILED:  org.apache.zookeeper.test.ClientPortBindTest.testBindByAddress

Error Message:
No such device

Stack Trace:
java.net.SocketException: No such device
	at java.net.NetworkInterface.isLoopback0(Native Method)
	at java.net.NetworkInterface.isLoopback(NetworkInterface.java:339)
	at org.apache.zookeeper.test.ClientPortBindTest.testBindByAddress(ClientPortBindTest.java:61)
	at org.apache.zookeeper.JUnit4ZKTestRunner$LoggedInvokeMethod.evaluate(JUnit4ZKTestRunner.java:55)



Mime
  • Unnamed multipart/mixed (inline, None, 0 bytes)
View raw message