zookeeper-dev mailing list archives

Site index · List index
Message view « Date » · « Thread »
Top « Date » · « Thread »
From Apache Jenkins Server <jenk...@builds.apache.org>
Subject ZooKeeper_branch35_jdk7 - Build # 407 - Still Failing
Date Mon, 02 Nov 2015 03:22:48 GMT
See https://builds.apache.org/job/ZooKeeper_branch35_jdk7/407/

###################################################################################
########################## LAST 60 LINES OF THE CONSOLE ###########################
[...truncated 377312 lines...]
     [exec] Log Message Received: [2015-11-02 03:20:54,819:9328(0x2b0eb0672540):ZOO_INFO@testLogCallbackInit@993:
testLogCallbackInit #8]
     [exec] Log Message Received: [2015-11-02 03:20:54,819:9328(0x2b0eb0672540):ZOO_INFO@testLogCallbackInit@993:
testLogCallbackInit #9]
     [exec] Log Message Received: [2015-11-02 03:20:54,820:9328(0x2b0eb0672540):ZOO_INFO@zookeeper_close@3239:
Closing zookeeper sessionId=0x100f43e33e8000e to [127.0.0.1:22181]
     [exec] ]
     [exec]  : elapsed 1000 : OK
     [exec] Zookeeper_simpleSystem::testLogCallbackClearLog Message Received: [2015-11-02
03:20:54,820:9328(0x2b0eb0672540):ZOO_INFO@log_env@1013: Client environment:zookeeper.version=zookeeper
C client 3.5.1]
     [exec] Log Message Received: [2015-11-02 03:20:54,820:9328(0x2b0eb0672540):ZOO_INFO@log_env@1017:
Client environment:host.name=proserpina.apache.org]
     [exec] Log Message Received: [2015-11-02 03:20:54,820:9328(0x2b0eb0672540):ZOO_INFO@log_env@1024:
Client environment:os.name=Linux]
     [exec] Log Message Received: [2015-11-02 03:20:54,820:9328(0x2b0eb0672540):ZOO_INFO@log_env@1025:
Client environment:os.arch=3.13.0-36-lowlatency]
     [exec] Log Message Received: [2015-11-02 03:20:54,820:9328(0x2b0eb0672540):ZOO_INFO@log_env@1026:
Client environment:os.version=#63-Ubuntu SMP PREEMPT Wed Sep 3 21:56:12 UTC 2014]
     [exec] Log Message Received: [2015-11-02 03:20:54,820:9328(0x2b0eb0672540):ZOO_INFO@log_env@1034:
Client environment:user.name=jenkins]
     [exec] Log Message Received: [2015-11-02 03:20:54,820:9328(0x2b0eb0672540):ZOO_INFO@log_env@1042:
Client environment:user.home=/home/jenkins]
     [exec] Log Message Received: [2015-11-02 03:20:54,820:9328(0x2b0eb0672540):ZOO_INFO@log_env@1054:
Client environment:user.dir=/home/jenkins/jenkins-slave/workspace/ZooKeeper_branch35_jdk7/branch-3.5/build/test/test-cppunit]
     [exec] Log Message Received: [2015-11-02 03:20:54,820:9328(0x2b0eb0672540):ZOO_INFO@zookeeper_init_internal@1097:
Initiating client connection, host=127.0.0.1:22181 sessionTimeout=10000 watcher=0x45d2a0 sessionId=0
sessionPasswd=<null> context=0x7fff905c77b0 flags=0]
     [exec] Log Message Received: [2015-11-02 03:20:54,820:9328(0x2b0eb3103700):ZOO_INFO@check_events@2339:
initiated connection to server [127.0.0.1:22181]]
     [exec] Log Message Received: [2015-11-02 03:20:54,847:9328(0x2b0eb3103700):ZOO_INFO@check_events@2391:
session establishment complete on server [127.0.0.1:22181], sessionId=0x100f43e33e8000f, negotiated
timeout=10000 ]
     [exec]  : elapsed 1000 : OK
     [exec] Zookeeper_simpleSystem::testAsyncWatcherAutoReset ZooKeeper server started : elapsed
10230 : OK
     [exec] Zookeeper_simpleSystem::testDeserializeString : elapsed 0 : OK
     [exec] Zookeeper_simpleSystem::testFirstServerDown : elapsed 1002 : OK
     [exec] Zookeeper_simpleSystem::testNullData : elapsed 1049 : OK
     [exec] Zookeeper_simpleSystem::testIPV6 : elapsed 1015 : OK
     [exec] Zookeeper_simpleSystem::testCreate : elapsed 1016 : OK
     [exec] Zookeeper_simpleSystem::testPath : elapsed 1174 : OK
     [exec] Zookeeper_simpleSystem::testPathValidation : elapsed 1141 : OK
     [exec] Zookeeper_simpleSystem::testPing : elapsed 17893 : OK
     [exec] Zookeeper_simpleSystem::testAcl : elapsed 1039 : OK
     [exec] Zookeeper_simpleSystem::testChroot : elapsed 3143 : OK
     [exec] Zookeeper_simpleSystem::testAuth ZooKeeper server started ZooKeeper server started
: elapsed 30496 : OK
     [exec] Zookeeper_simpleSystem::testHangingClient : elapsed 1038 : OK
     [exec] Zookeeper_simpleSystem::testWatcherAutoResetWithGlobal ZooKeeper server started
ZooKeeper server started ZooKeeper server started : elapsed 14820 : OK
     [exec] Zookeeper_simpleSystem::testWatcherAutoResetWithLocal ZooKeeper server started
ZooKeeper server started ZooKeeper server started : elapsed 14962 : OK
     [exec] Zookeeper_simpleSystem::testGetChildren2 : elapsed 1068 : OK
     [exec] Zookeeper_simpleSystem::testLastZxid : elapsed 4540 : OK
     [exec] Zookeeper_simpleSystem::testRemoveWatchers ZooKeeper server started : elapsed
4324 : OK
     [exec] Zookeeper_readOnly::testReadOnly : elapsed 4133 : OK
     [exec] /home/jenkins/jenkins-slave/workspace/ZooKeeper_branch35_jdk7/branch-3.5/src/c/tests/TestReconfig.cc:154:
Assertion: assertion failed [Expression: false]
     [exec] Failures !!!
     [exec] Run: 72   Failure total: 1   Failures: 1   Errors: 0
     [exec] FAIL: zktest-mt
     [exec] ==========================================
     [exec] 1 of 2 tests failed
     [exec] Please report to user@zookeeper.apache.org
     [exec] ==========================================
     [exec] make[1]: Leaving directory `/home/jenkins/jenkins-slave/workspace/ZooKeeper_branch35_jdk7/branch-3.5/build/test/test-cppunit'
     [exec] make[1]: *** [check-TESTS] Error 1
     [exec] make: *** [check-am] Error 2

BUILD FAILED
/home/jenkins/jenkins-slave/workspace/ZooKeeper_branch35_jdk7/branch-3.5/build.xml:1494: The
following error occurred while executing this line:
/home/jenkins/jenkins-slave/workspace/ZooKeeper_branch35_jdk7/branch-3.5/build.xml:1454: The
following error occurred while executing this line:
/home/jenkins/jenkins-slave/workspace/ZooKeeper_branch35_jdk7/branch-3.5/build.xml:1464: exec
returned: 2

Total time: 15 minutes 45 seconds
Build step 'Invoke Ant' marked build as failure
Archiving artifacts
Recording test results
Email was triggered for: Failure - Any
Sending email for trigger: Failure - Any



###################################################################################
############################## FAILED TESTS (if any) ##############################
All tests passed
Mime
  • Unnamed multipart/mixed (inline, None, 0 bytes)
View raw message